{"text_format":"1","workbook":"xlsx","n_sheets":17,"sheets":["Accueil","Informations","Élèves","Saisie","Imprimer","Bilan - élève","Difficultés - élève","Réussites - élève","Bilan - classe","Difficultés - classe","Réussites - classe","Synthèse - classe","Profil - classe","Répartition","Groupes de besoin","Programmes","Paramètres"],"not_rendered":{"charts":2,"images":0,"macros":1,"external_links":0,"defined_names":25,"comments":0,"pivot_tables":0},"unopened":[],"bounds":{"document_bytes":16777216,"sheet_cells":100000,"rows_first":2000,"rows_last":500,"rows_between":2000,"halvings":0,"cell_chars":16384,"cell_head_chars":4096},"cells_cut":0,"cells_raw":0,"read":"whole","date_system":"1900"}

{"sheet":"Accueil","index":0,"n_rows":38,"n_cols":1,"rows_kept":38,"cut":false,"hidden":false,"merged":[]}
["Présentation"]
[]
["Ce fichier concerne la saisie et l'analyse des résultats de l'évaluation diagnostique de CE2 de septembre 2016 dans l'académie de Paris. Il fonctionne avec Excel uniquement. N'utilisez pas LibreOffice ou OpenOffice sous peine d'altérer le fichier lors de la sauvegarde. Une version d'Excel est installée sur le poste maître dans chaque école de la ville de Paris. Si le fichier a été altéré avec LibreOffice pour saisir des résultats, la méthode la plus simple pour récupérer les données est de copier/coller les plages de données des onglets jaunes (Informations, Élèves et surtout Saisie) dans une version vierge du fichier à partir d'Excel."]
[]
["Pour obtenir des documents d'analyse complets et rigoureux, il faut :"]
["1. Compléter les informations de l'onglet Informations."]
["2. Compléter la liste des élèves de l'onglet Élèves. Le nom de famille peut être saisi en minuscules, il sera automatiquement affiché en majuscules dans les documents."]
["3. Saisir les résultats des élèves dans l'onglet Saisie. Lors de la saisie, un affichage en rouge indique que la saisie est actuellement incomplète. Un affichage en vert valide la saisie complète. Attention, il ne faut pas confondre les absences de réponse en situation d'évaluation et les absences de l'élève lors de l'évaluation. Les absences de réponse en situation d'évaluation sont saisies par un 0, les absences de réponse en raison d'une absence de l'élève sont saisies par des cellules laissées vides. Cette différence est essentielle, car dans le premier cas, une erreur est bien comptée alors que dans le deuxième l'exercice n'est pas pris en compte."]
[]
["Attention, en français, pour les exercices 2 et 3, il faut saisir uniquement les items liés aux questions 1, 2, 3, 4, 5 et non l'item de synthèse qui figure en tête d'exercice."]
[]
["L'analyse des résultats est disponible dans les onglets suivants : Bilan des élèves, Réussites de l'élève, Bilan de la classe, Réussites de la classe, Synthèse des résultats, Profil de la classe, Groupes de besoin."]
[]
["Pour imprimer les documents :"]
["- Choisissez d'abord le mode d'impression (économie d'encre ou non) dans l'onglet Informations."]
["- Soit vous utilisez Excel sur PC et dans ce cas vous pouvez activer une fonction nommée Macros. Dans ce cas, il suffit d'utiliser l'onglet Imprimer qui simplifiera largement l'impression en rendant automatique l'impression du bilan de tous les élèves."]
["- Soit ce n'est pas le cas et cet onglet risque de ne pas fonctionner pour vous. L'impression se fait alors manuellement, onglet par onglet, et il est nécessaire de sélectionner un à un les noms de tous les élèves, en cliquant en haut à gauche de la page sur le nom d'élève, pour afficher successivement tous les bilans d'élèves."]
[]
["Pour information, les compétences mentionnées correspondent aux attendus de fin de cycle 2 des programmes 2016. Le choix a été fait de faire figurer tous les attendus, même ceux qui ne sont aucunement évalués, pour que l'enseignant n'omette pas de considérer les autres attendus."]
[]
["Enfin, un mot sur la mise en forme des résultats. L'objectif était de les rendre à la fois intuitifs et précis. Sont pris en compte quatre niveaux de difficulté des items et différents degrés de réussite pour chaque niveau de difficulté. Sans entrer dans des détails techniques, un code de correction 1 correspond à une couleur verte, un code de correction 2 à une couleur jaune et les codes de correction 8, 9 et 0 correspondent à une couleur rouge. Pour certains attendus, plusieurs résultats se cumulent et alors, par exemple, un ensemble de résultats constitué des codes 1 et 9 aboutit à une couleur jaune. Quelques résultats chiffrés sont aussi proposés dans des documents qui ne concernent que les équipes pédagogiques (Bilan - classe et Synthèse - classe)."]
[]
["Les documents générés ne se substituent pas à une analyse attentive des traces écrites des élèves et des codes de correction du livret."]
[]
["Version"]
[]
["Version du 18/09/2016"]
[]
["Remerciements"]
[]
["Merci à Madame Goubier, IEN, et à Madame Dubois-Lazzarotto, IEN Cardie Adj., pour leur confiance."]
["Merci à Denis Desjours pour le suivi du projet et aux FIP pour les tests de ce fichier de saisie."]
["Merci aux inspectrices Catherine Clément et Catherine Hennequin pour leur soutien, merci à Annie Macary et Joëlle Hardy-Vulbeau pour leurs conseils, merci aux directeurs et aux enseignants de la 5-6 et de la 7-8 pour leurs retours sur la version 2015 du fichier."]
[]
["Auteur"]
[]
["Frédéric Untz, maître formateur, académie de Paris"]
["Mail : frederic.untz@ac-paris.fr"]

{"sheet":"Informations","index":1,"n_rows":15,"n_cols":2,"rows_kept":15,"cut":false,"hidden":false,"merged":[[11,0,11,1]]}
[]
["Année scolaire","2016-2017"]
["Circonscription"]
["Type d'école"]
["Nom de l'école"]
["Enseignante ou enseignant"]
["Nom de l'enseignant"]
["Directrice ou directeur"]
["Nom du directeur"]
["Mode d'économie d'encre","Non"]
[]
["Pied de page généré dans la feuille bilan à partir des données qui précèdent :"]
[]
[{"$f":"Informations!B6 & \" : \" & Informations!B7","v":" : "},{"$f":"Informations!B8 & \" : \" &  Informations!B9","v":" : "}]
[{"$f":"IF(OR(ISBLANK(Informations!B4),ISBLANK(Informations!B5)),\"\",Informations!B4&\" \"&Informations!B5)","v":""},{"$f":"IF(ISBLANK(B3),\"\",\"Circonscription \"&B3)","v":""}]

{"sheet":"Élèves","index":2,"n_rows":39,"n_cols":4,"rows_kept":39,"cut":false,"hidden":false,"merged":[]}
[null,"Prénom","Nom","Nom entier"]
[1,null,null,{"$f":"B2 & \" \" & UPPER(C2)","v":" "}]
[{"$f":"IF(ISTEXT(B3),A2+1,\"\")","v":""},null,null,{"$f":"B3 & \" \" & UPPER(C3)","v":" "}]
[{"$f":"IF(ISTEXT(B4),A3+1,\"\")","v":""},null,null,{"$f":"B4 & \" \" & UPPER(C4)","v":" "}]
["",null,null," "]
["",null,null," "]
["",null,null," "]
["",null,null," "]
["",null,null," "]
["",null,null," "]
["",null,null," "]
["",null,null," "]
["",null,null," "]
["",null,null," "]
["",null,null," "]
["",null,null," "]
["",null,null," "]
["",null,null," "]
["",null,null," "]
["",null,null," "]
["",null,null," "]
["",null,null," "]
["",null,null," "]
["",null,null," "]
["",null,null," "]
["",null,null," "]
["",null,null," "]
["",null,null," "]
["",null,null," "]
["",null,null," "]
["",null,null," "]
["",null,null," "]
["",null,null," "]
["",null,null," "]
["",null,null," "]
["",null,null," "]
[]
[null,"Total des élèves"]
[null,{"$f":"35-COUNTBLANK(B2:B36)","v":0}]

{"sheet":"Saisie","index":3,"n_rows":40,"n_cols":971,"rows_kept":40,"cut":false,"hidden":false,"merged":[[25,0,26,0],[27,0,29,0],[1,0,3,0],[4,0,8,0],[9,0,10,0],[11,0,12,0],[13,0,24,0],[14,2,18,2],[19,2,23,2],[14,651,23,651],[14,652,23,652],[14,653,23,653],[14,654,23,654],[14,655,23,655],[14,656,23,656],[14,657,23,657],[14,658,23,658],[14,659,23,659],[14,660,23,660],[14,661,23,661],[14,662,23,662],[14,663,23,663],[14,664,23,664],[14,665,23,665],[14,666,23,666],[14,667,23,667],[14,668,23,668],[14,669,23,669],[14,670,23,670],[14,671,23,671],[14,672,23,672],[14,673,23,673],[14,674,23,674],[14,675,23,675],[14,676,23,676],[14,677,23,677],[14,678,23,678],[14,683,23,683],[14,684,23,684],[14,685,23,685],[14,679,23,679],[14,680,23,680],[14,681,23,681],[14,682,23,682]]}
["Séquences","Items","Exercices","Questions",{"$f":"IF(ISTEXT(INDEX(liste_des_eleves,COLUMN()-4)),INDEX(liste_des_eleves,COLUMN()-4),\"\")","v":" "}," "," "," "," "," "," "," "," "," "," "," "," "," "," "," "," "," "," "," "," "," "," "," "," "," "," "," "," "," "," "," "," "," "," ",{"$f":"IF(ISTEXT(INDEX(liste_des_eleves,CELL(\"contenu\",'Bilan - élève'!$J$1))),INDEX(liste_des_eleves,CELL(\"contenu\",'Bilan - élève'!$J$1)),\"\")","v":" "},"Items (F1=1, M1=14)","Attendus","Niveaux de difficulté",{"$f":"ROUNDDOWN((COLUMN()-44)/4,0)+1","v":1},{"$f":"ROUNDDOWN((COLUMN()-44)/4,0)+1","v":1},1,1,2,2,2,2,3,3,3,3,4,4,4,4,5,5,5,5,6,6,6,6,7,7,7,7,8,8,8,8,9,9,9,9,10,10,10,10,11,11,11,11,12,12,12,12,13,13,13,13,14,14,14,14,15,15,15,15,16,16,16,16,17,{"$f":"ROUNDDOWN((COLUMN()-44)/4,0)+1","v":17},17,17,18,18,18,18,19,19,19,19,20,20,20,20,21,21,21,21,22,22,22,22,23,23,23,23,24,24,24,24,25,25,25,25,26,26,26,26,27,27,27,27,28,28,28,28,29,29,29,29,30,30,30,30,31,31,31,31,32,32,32,32,33,{"$f":"ROUNDDOWN((COLUMN()-44)/4,0)+1","v":33},33,33,34,34,34,34,35,35,35,35,36,36,36,36,37,37,37,37,38,38,38,38,39,39,39,39,40,40,40,40,41,41,41,41,42,42,42,42,43,43,43,43,44,44,44,44,45,45,45,45,46,46,46,46,47,47,47,47,48,48,48,48,49,{"$f":"ROUNDDOWN((COLUMN()-44)/4,0)+1","v":49},49,49,50,50,50,50,"Moyennes","Items (F1=1, M1=14)","Attendus","Niveaux",{"$f":"ROUNDDOWN((COLUMN()-248)/4,0)+1","v":1},{"$f":"ROUNDDOWN((COLUMN()-248)/4,0)+1","v":1},{"$f":"ROUNDDOWN((COLUMN()-248)/4,0)+1","v":1},1,2,2,2,2,3,3,3,3,4,4,4,4,5,5,5,5,6,6,6,6,7,7,7,7,8,8,8,8,9,9,9,9,10,10,10,10,11,11,11,11,12,12,12,12,13,13,13,13,14,14,14,14,15,15,15,15,16,16,16,16,17,17,{"$f":"ROUNDDOWN((COLUMN()-248)/4,0)+1","v":17},17,18,18,18,18,19,19,19,19,20,20,20,20,21,21,21,21,22,22,22,22,23,23,23,23,24,24,24,24,25,25,25,25,26,26,26,26,27,27,27,27,28,28,28,28,29,29,29,29,30,30,30,30,31,31,31,31,32,32,32,32,33,33,{"$f":"ROUNDDOWN((COLUMN()-248)/4,0)+1","v":33},33,34,34,34,34,35,35,35,35,36,36,36,36,37,37,37,37,38,38,38,38,39,39,39,39,40,40,40,40,41,41,41,41,42,42,42,42,43,43,43,43,44,44,44,44,45,45,45,45,46,46,46,46,47,47,47,47,48,48,48,48,49,49,{"$f":"ROUNDDOWN((COLUMN()-248)/4,0)+1","v":49},49,50,50,50,50,"Moyennes des A","Items (F1=1, M1=14)","Attendus","Niveaux",{"$f":"ROUNDDOWN((COLUMN()-452)/4,0)+1","v":1},1,1,1,2,2,2,2,3,3,3,3,4,4,4,4,5,5,5,5,6,6,6,6,7,7,7,7,8,8,8,8,{"$f":"ROUNDDOWN((COLUMN()-452)/4,0)+1","v":9},9,9,9,10,10,10,10,11,11,11,11,12,12,12,12,13,13,13,13,14,14,14,14,15,15,15,15,16,16,16,16,{"$f":"ROUNDDOWN((COLUMN()-452)/4,0)+1","v":17},17,17,17,18,18,18,18,19,19,19,19,20,20,20,20,21,21,21,21,22,22,22,22,23,23,23,23,24,24,24,24,{"$f":"ROUNDDOWN((COLUMN()-452)/4,0)+1","v":25},25,25,25,26,26,26,26,27,27,27,27,28,28,28,28,29,29,29,29,30,30,30,30,31,31,31,31,32,32,32,32,{"$f":"ROUNDDOWN((COLUMN()-452)/4,0)+1","v":33},33,33,33,34,34,34,34,35,35,35,35,36,36,36,36,37,37,37,37,38,38,38,38,39,39,39,39,40,40,40,40,{"$f":"ROUNDDOWN((COLUMN()-452)/4,0)+1","v":41},41,41,41,42,42,42,42,43,43,43,43,44,44,44,44,45,45,45,45,46,46,46,46,47,47,47,47,48,48,48,48,{"$f":"ROUNDDOWN((COLUMN()-452)/4,0)+1","v":49},49,49,49,50,50,50,50,{"$f":"IF(ISTEXT(INDEX(liste_des_eleves,COLUMN()-447)),INDEX(liste_des_eleves,COLUMN()-447),\"\")","v":""},"","","","","","","","","","","","","","","","","","","","","","","","","","","","","","","","","","","Élève sélectionné","Conversion quartiles",{"$f":"IF(ISTEXT(INDEX(liste_des_eleves,COLUMN()-688)),INDEX(liste_des_eleves,COLUMN()-688),\"\")","v":" "}," "," "," "," "," "," "," "," "," "," "," "," "," "," "," "," "," "," "," "," "," "," "," "," "," "," "," "," "," "," "," "," "," "," ",null,null,null,null,null,null,null,null,null,null,null,null,{"$f":"ROUNDDOWN((COLUMN()-736)/4,0)+1","v":1},{"$f":"ROUNDDOWN((COLUMN()-736)/4,0)+1","v":1},1,1,2,2,2,2,3,3,3,3,4,4,4,4,5,5,5,5,6,6,6,6,7,7,7,7,8,8,8,8,9,9,9,9,10,10,10,10,11,11,11,11,12,12,12,12,13,13,13,13,14,14,14,14,15,15,15,15,16,16,16,16,17,{"$f":"ROUNDDOWN((COLUMN()-736)/4,0)+1","v":17},17,17,18,18,18,18,19,19,19,19,20,20,20,20,21,21,21,21,22,22,22,22,23,23,23,23,24,24,24,24,25,25,25,25,26,26,26,26,27,27,27,27,28,28,28,28,29,29,29,29,30,30,30,30,31,31,31,31,32,32,32,32,33,{"$f":"ROUNDDOWN((COLUMN()-736)/4,0)+1","v":33},33,33,34,34,34,34,35,35,35,35,36,36,36,36,37,37,37,37,38,38,38,38,39,39,39,39,40,40,40,40,41,41,41,41,42,42,42,42,43,43,43,43,44,44,44,44,45,45,45,45,46,46,46,46,47,47,47,47,48,48,48,48,49,{"$f":"ROUNDDOWN((COLUMN()-736)/4,0)+1","v":49},49,49,50,50,50,50,null,{"$f":"IF(ISTEXT(INDEX(liste_des_eleves,COLUMN()-688)),INDEX(liste_des_eleves,COLUMN()-688),\"\")","v":""},"","","","","","","","","","","","","","","","","","","","","","","","","","","","","","","","","",""]
[1,{"$f":"AO2","v":14},1,null,null,null,null,null,null,null,null,null,null,null,null,null,null,null,null,null,null,null,null,null,null,null,null,null,null,null,null,null,null,null,null,null,null,null,null,{"$f":"IF($ZK2=1,3,IF($ZK2=2,2,IF($ZK2=8,1,IF($ZK2=9,0,IF($ZK2=0,\"A\",\"\")))))","v":""},14,{"$f":"INDEX(liste_des_items_de_mathematiques,AO2-13)","v":"Comprendre et utiliser des nombres entiers pour dénombrer, ordonner, repérer, comparer."},2,{"$f":"IF(AND(AR$1=$AO2,AR$32=$AQ2),$AN2,\"\")","v":""},"","","","","","","","","",{"$f":"IF(AND(BB$1=$AO2,BB$32=$AQ2),$AN2,\"\")","v":""},"","","","","","","","","",{"$f":"IF(AND(BL$1=$AO2,BL$32=$AQ2),$AN2,\"\")","v":""},"","","","","","","","","",{"$f":"IF(AND(BV$1=$AO2,BV$32=$AQ2),$AN2,\"\")","v":""},"","","","","","","","","",{"$f":"IF(AND(CF$1=$AO2,CF$32=$AQ2),$AN2,\"\")","v":""},"","","","","","","","","",{"$f":"IF(AND(CP$1=$AO2,CP$32=$AQ2),$AN2,\"\")","v":""},"","","","","","","","","",{"$f":"IF(AND(CZ$1=$AO2,CZ$32=$AQ2),$AN2,\"\")","v":""},"","","","","","","","","",{"$f":"IF(AND(DJ$1=$AO2,DJ$32=$AQ2),$AN2,\"\")","v":""},"","","","","","","","","",{"$f":"IF(AND(DT$1=$AO2,DT$32=$AQ2),$AN2,\"\")","v":""},"","","","","","","","","",{"$f":"IF(AND(ED$1=$AO2,ED$32=$AQ2),$AN2,\"\")","v":""},"","","","","","","","","",{"$f":"IF(AND(EN$1=$AO2,EN$32=$AQ2),$AN2,\"\")","v":""},"","","","","","","","","",{"$f":"IF(AND(EX$1=$AO2,EX$32=$AQ2),$AN2,\"\")","v":""},"","","","","","","","","",{"$f":"IF(AND(FH$1=$AO2,FH$32=$AQ2),$AN2,\"\")","v":""},"","","","","","","","","",{"$f":"IF(AND(FR$1=$AO2,FR$32=$AQ2),$AN2,\"\")","v":""},"","","","","","","","","",{"$f":"IF(AND(GB$1=$AO2,GB$32=$AQ2),$AN2,\"\")","v":""},"","","","","","","","","",{"$f":"IF(AND(GL$1=$AO2,GL$32=$AQ2),$AN2,\"\")","v":""},"","","","","","","","","",{"$f":"IF(AND(GV$1=$AO2,GV$32=$AQ2),$AN2,\"\")","v":""},"","","","","","","","","",{"$f":"IF(AND(HF$1=$AO2,HF$32=$AQ2),$AN2,\"\")","v":""},"","","","","","","","","",{"$f":"IF(AND(HP$1=$AO2,HP$32=$AQ2),$AN2,\"\")","v":""},"","","","","","","","","",{"$f":"IF(AND(HZ$1=$AO2,HZ$32=$AQ2),$AN2,\"\")","v":""},"","","","","","","","","",{"$f":"IF(COUNT($AJA2:$AKI2)=0,\"\",SUM($AJA2:$AKI2)/(COUNT($AJA2:$AKI2)*$ZL2))","v":""},14,{"$f":"INDEX(liste_des_items_de_mathematiques,IK2-13)","v":"Comprendre et utiliser des nombres entiers pour dénombrer, ordonner, repérer, comparer."},2,{"$f":"IF(AND(IN$1=$AO2,IN$32=$AQ2,ISNUMBER($IJ2)),$IJ2*$ZL2,\"\")","v":""},"","","","","","","","","",{"$f":"IF(AND(IX$1=$AO2,IX$32=$AQ2,ISNUMBER($IJ2)),$IJ2*$ZL2,\"\")","v":""},"","","","","","","","","",{"$f":"IF(AND(JH$1=$AO2,JH$32=$AQ2,ISNUMBER($IJ2)),$IJ2*$ZL2,\"\")","v":""},"","","","","","","","","",{"$f":"IF(AND(JR$1=$AO2,JR$32=$AQ2,ISNUMBER($IJ2)),$IJ2*$ZL2,\"\")","v":""},"","","","","","","","","",{"$f":"IF(AND(KB$1=$AO2,KB$32=$AQ2,ISNUMBER($IJ2)),$IJ2*$ZL2,\"\")","v":""},"","","","","","","","","",{"$f":"IF(AND(KL$1=$AO2,KL$32=$AQ2,ISNUMBER($IJ2)),$IJ2*$ZL2,\"\")","v":""},"","","","","","","","","",{"$f":"IF(AND(KV$1=$AO2,KV$32=$AQ2,ISNUMBER($IJ2)),$IJ2*$ZL2,\"\")","v":""},"","","","","","","","","",{"$f":"IF(AND(LF$1=$AO2,LF$32=$AQ2,ISNUMBER($IJ2)),$IJ2*$ZL2,\"\")","v":""},"","","","","","","","","",{"$f":"IF(AND(LP$1=$AO2,LP$32=$AQ2,ISNUMBER($IJ2)),$IJ2*$ZL2,\"\")","v":""},"","","","","","","","","",{"$f":"IF(AND(LZ$1=$AO2,LZ$32=$AQ2,ISNUMBER($IJ2)),$IJ2*$ZL2,\"\")","v":""},"","","","","","","","","",{"$f":"IF(AND(MJ$1=$AO2,MJ$32=$AQ2,ISNUMBER($IJ2)),$IJ2*$ZL2,\"\")","v":""},"","","","","","","","","",{"$f":"IF(AND(MT$1=$AO2,MT$32=$AQ2,ISNUMBER($IJ2)),$IJ2*$ZL2,\"\")","v":""},"","","","","","","","","",{"$f":"IF(AND(ND$1=$AO2,ND$32=$AQ2,ISNUMBER($IJ2)),$IJ2*$ZL2,\"\")","v":""},"","","","","","","","","",{"$f":"IF(AND(NN$1=$AO2,NN$32=$AQ2,ISNUMBER($IJ2)),$IJ2*$ZL2,\"\")","v":""},"","","","","","","","","",{"$f":"IF(AND(NX$1=$AO2,NX$32=$AQ2,ISNUMBER($IJ2)),$IJ2*$ZL2,\"\")","v":""},"","","","","","","","","",{"$f":"IF(AND(OH$1=$AO2,OH$32=$AQ2,ISNUMBER($IJ2)),$IJ2*$ZL2,\"\")","v":""},"","","","","","","","","",{"$f":"IF(AND(OR$1=$AO2,OR$32=$AQ2,ISNUMBER($IJ2)),$IJ2*$ZL2,\"\")","v":""},"","","","","","","","","",{"$f":"IF(AND(PB$1=$AO2,PB$32=$AQ2,ISNUMBER($IJ2)),$IJ2*$ZL2,\"\")","v":""},"","","","","","","","","",{"$f":"IF(AND(PL$1=$AO2,PL$32=$AQ2,ISNUMBER($IJ2)),$IJ2*$ZL2,\"\")","v":""},"","","","","","","","","",{"$f":"IF(AND(PV$1=$AO2,PV$32=$AQ2,ISNUMBER($IJ2)),$IJ2*$ZL2,\"\")","v":""},"","","","","","","","","",{"$f":"IF(COUNT($AJA2:$AKI2)=0,\"\",COUNTIF($ZM2:$AAU2,\"A\")/(COUNT($AJA2:$AKI2)))","v":""},14,{"$f":"INDEX(liste_des_items_de_mathematiques,QG2-13)","v":"Comprendre et utiliser des nombres entiers pour dénombrer, ordonner, repérer, comparer."},2,{"$f":"IF(AND(QJ$1=$AO2,QJ$32=$AQ2),$QF2,\"\")","v":""},"","","","","","","","","",{"$f":"IF(AND(QT$1=$AO2,QT$32=$AQ2),$QF2,\"\")","v":""},"","","","","","","","","",{"$f":"IF(AND(RD$1=$AO2,RD$32=$AQ2),$QF2,\"\")","v":""},"","","","","","","","","",{"$f":"IF(AND(RN$1=$AO2,RN$32=$AQ2),$QF2,\"\")","v":""},"","","","","","","","","",{"$f":"IF(AND(RX$1=$AO2,RX$32=$AQ2),$QF2,\"\")","v":""},"","","","","","","","","",{"$f":"IF(AND(SH$1=$AO2,SH$32=$AQ2),$QF2,\"\")","v":""},"","","","","","","","","",{"$f":"IF(AND(SR$1=$AO2,SR$32=$AQ2),$QF2,\"\")","v":""},"","","","","","","","","",{"$f":"IF(AND(TB$1=$AO2,TB$32=$AQ2),$QF2,\"\")","v":""},"","","","","","","","","",{"$f":"IF(AND(TL$1=$AO2,TL$32=$AQ2),$QF2,\"\")","v":""},"","","","","","","","","",{"$f":"IF(AND(TV$1=$AO2,TV$32=$AQ2),$QF2,\"\")","v":""},"","","","","","","","","",{"$f":"IF(AND(UF$1=$AO2,UF$32=$AQ2),$QF2,\"\")","v":""},"","","","","","","","","",{"$f":"IF(AND(UP$1=$AO2,UP$32=$AQ2),$QF2,\"\")","v":""},"","","","","","","","","",{"$f":"IF(AND(UZ$1=$AO2,UZ$32=$AQ2),$QF2,\"\")","v":""},"","","","","","","","","",{"$f":"IF(AND(VJ$1=$AO2,VJ$32=$AQ2),$QF2,\"\")","v":""},"","","","","","","","","",{"$f":"IF(AND(VT$1=$AO2,VT$32=$AQ2),$QF2,\"\")","v":""},"","","","","","","","","",{"$f":"IF(AND(WD$1=$AO2,WD$32=$AQ2),$QF2,\"\")","v":""},"","","","","","","","","",{"$f":"IF(AND(WN$1=$AO2,WN$32=$AQ2),$QF2,\"\")","v":""},"","","","","","","","","",{"$f":"IF(AND(WX$1=$AO2,WX$32=$AQ2),$QF2,\"\")","v":""},"","","","","","","","","",{"$f":"IF(AND(XH$1=$AO2,XH$32=$AQ2),$QF2,\"\")","v":""},"","","","","","","","","",{"$f":"IF(AND(XR$1=$AO2,XR$32=$AQ2),$QF2,\"\")","v":""},"","","","","","","","","",{"$f":"IF(COUNT(E2,E3,E5)=0,\"\",SUM(ZM2,ZM3,ZM5)/($ZL2*COUNT(E2,E3,E5)))","v":""},{"$f":"IF(COUNT(F2,F3,F5)=0,\"\",SUM(ZN2,ZN3,ZN5)/($ZL2*COUNT(F2,F3,F5)))","v":""},"","","","","","","","","","","","","","","","","","","","","","","","","","","","","","","","","",{"$f":"IF(OR(ISBLANK(INDEX(liste_des_resultats,ROW()-1,CELL(\"contenu\",'Bilan - élève'!$J$1))),ISERROR(INDEX(liste_des_resultats,ROW()-1,CELL(\"contenu\",'Bilan - élève'!$J$1)))),\"\",INDEX(liste_des_resultats,ROW()-1,CELL(\"contenu\",'Bilan - élève'!$J$1)))","v":""},3,{"$f":"IF(E2=1,3,IF(E2=2,2,IF(E2=8,1,IF(E2=9,0,IF(ISBLANK(E2),\"\",IF(E2=0,\"A\"))))))","v":""},{"$f":"IF(F2=1,3,IF(F2=2,2,IF(F2=8,1,IF(F2=9,0,IF(ISBLANK(F2),\"\",IF(F2=0,\"A\"))))))","v":""},{"$f":"IF(G2=1,3,IF(G2=2,2,IF(G2=8,1,IF(G2=9,0,IF(ISBLANK(G2),\"\",IF(G2=0,\"A\"))))))","v":""},{"$f":"IF(H2=1,3,IF(H2=2,2,IF(H2=8,1,IF(H2=9,0,IF(ISBLANK(H2),\"\",IF(H2=0,\"A\"))))))","v":""},{"$f":"IF(I2=1,3,IF(I2=2,2,IF(I2=8,1,IF(I2=9,0,IF(ISBLANK(I2),\"\",IF(I2=0,\"A\"))))))","v":""},{"$f":"IF(J2=1,3,IF(J2=2,2,IF(J2=8,1,IF(J2=9,0,IF(ISBLANK(J2),\"\",IF(J2=0,\"A\"))))))","v":""},{"$f":"IF(K2=1,3,IF(K2=2,2,IF(K2=8,1,IF(K2=9,0,IF(ISBLANK(K2),\"\",IF(K2=0,\"A\"))))))","v":""},{"$f":"IF(L2=1,3,IF(L2=2,2,IF(L2=8,1,IF(L2=9,0,IF(ISBLANK(L2),\"\",IF(L2=0,\"A\"))))))","v":""},{"$f":"IF(M2=1,3,IF(M2=2,2,IF(M2=8,1,IF(M2=9,0,IF(ISBLANK(M2),\"\",IF(M2=0,\"A\"))))))","v":""},{"$f":"IF(N2=1,3,IF(N2=2,2,IF(N2=8,1,IF(N2=9,0,IF(ISBLANK(N2),\"\",IF(N2=0,\"A\"))))))","v":""},{"$f":"IF(O2=1,3,IF(O2=2,2,IF(O2=8,1,IF(O2=9,0,IF(ISBLANK(O2),\"\",IF(O2=0,\"A\"))))))","v":""},{"$f":"IF(P2=1,3,IF(P2=2,2,IF(P2=8,1,IF(P2=9,0,IF(ISBLANK(P2),\"\",IF(P2=0,\"A\"))))))","v":""},{"$f":"IF(Q2=1,3,IF(Q2=2,2,IF(Q2=8,1,IF(Q2=9,0,IF(ISBLANK(Q2),\"\",IF(Q2=0,\"A\"))))))","v":""},{"$f":"IF(R2=1,3,IF(R2=2,2,IF(R2=8,1,IF(R2=9,0,IF(ISBLANK(R2),\"\",IF(R2=0,\"A\"))))))","v":""},{"$f":"IF(S2=1,3,IF(S2=2,2,IF(S2=8,1,IF(S2=9,0,IF(ISBLANK(S2),\"\",IF(S2=0,\"A\"))))))","v":""},{"$f":"IF(T2=1,3,IF(T2=2,2,IF(T2=8,1,IF(T2=9,0,IF(ISBLANK(T2),\"\",IF(T2=0,\"A\"))))))","v":""},{"$f":"IF(U2=1,3,IF(U2=2,2,IF(U2=8,1,IF(U2=9,0,IF(ISBLANK(U2),\"\",IF(U2=0,\"A\"))))))","v":""},{"$f":"IF(V2=1,3,IF(V2=2,2,IF(V2=8,1,IF(V2=9,0,IF(ISBLANK(V2),\"\",IF(V2=0,\"A\"))))))","v":""},{"$f":"IF(W2=1,3,IF(W2=2,2,IF(W2=8,1,IF(W2=9,0,IF(ISBLANK(W2),\"\",IF(W2=0,\"A\"))))))","v":""},{"$f":"IF(X2=1,3,IF(X2=2,2,IF(X2=8,1,IF(X2=9,0,IF(ISBLANK(X2),\"\",IF(X2=0,\"A\"))))))","v":""},{"$f":"IF(Y2=1,3,IF(Y2=2,2,IF(Y2=8,1,IF(Y2=9,0,IF(ISBLANK(Y2),\"\",IF(Y2=0,\"A\"))))))","v":""},{"$f":"IF(Z2=1,3,IF(Z2=2,2,IF(Z2=8,1,IF(Z2=9,0,IF(ISBLANK(Z2),\"\",IF(Z2=0,\"A\"))))))","v":""},{"$f":"IF(AA2=1,3,IF(AA2=2,2,IF(AA2=8,1,IF(AA2=9,0,IF(ISBLANK(AA2),\"\",IF(AA2=0,\"A\"))))))","v":""},{"$f":"IF(AB2=1,3,IF(AB2=2,2,IF(AB2=8,1,IF(AB2=9,0,IF(ISBLANK(AB2),\"\",IF(AB2=0,\"A\"))))))","v":""},{"$f":"IF(AC2=1,3,IF(AC2=2,2,IF(AC2=8,1,IF(AC2=9,0,IF(ISBLANK(AC2),\"\",IF(AC2=0,\"A\"))))))","v":""},{"$f":"IF(AD2=1,3,IF(AD2=2,2,IF(AD2=8,1,IF(AD2=9,0,IF(ISBLANK(AD2),\"\",IF(AD2=0,\"A\"))))))","v":""},{"$f":"IF(AE2=1,3,IF(AE2=2,2,IF(AE2=8,1,IF(AE2=9,0,IF(ISBLANK(AE2),\"\",IF(AE2=0,\"A\"))))))","v":""},{"$f":"IF(AF2=1,3,IF(AF2=2,2,IF(AF2=8,1,IF(AF2=9,0,IF(ISBLANK(AF2),\"\",IF(AF2=0,\"A\"))))))","v":""},{"$f":"IF(AG2=1,3,IF(AG2=2,2,IF(AG2=8,1,IF(AG2=9,0,IF(ISBLANK(AG2),\"\",IF(AG2=0,\"A\"))))))","v":""},{"$f":"IF(AH2=1,3,IF(AH2=2,2,IF(AH2=8,1,IF(AH2=9,0,IF(ISBLANK(AH2),\"\",IF(AH2=0,\"A\"))))))","v":""},{"$f":"IF(AI2=1,3,IF(AI2=2,2,IF(AI2=8,1,IF(AI2=9,0,IF(ISBLANK(AI2),\"\",IF(AI2=0,\"A\"))))))","v":""},{"$f":"IF(AJ2=1,3,IF(AJ2=2,2,IF(AJ2=8,1,IF(AJ2=9,0,IF(ISBLANK(AJ2),\"\",IF(AJ2=0,\"A\"))))))","v":""},{"$f":"IF(AK2=1,3,IF(AK2=2,2,IF(AK2=8,1,IF(AK2=9,0,IF(ISBLANK(AK2),\"\",IF(AK2=0,\"A\"))))))","v":""},{"$f":"IF(AL2=1,3,IF(AL2=2,2,IF(AL2=8,1,IF(AL2=9,0,IF(ISBLANK(AL2),\"\",IF(AL2=0,\"A\"))))))","v":""},{"$f":"IF(AM2=1,3,IF(AM2=2,2,IF(AM2=8,1,IF(AM2=9,0,IF(ISBLANK(AM2),\"\",IF(AM2=0,\"A\"))))))","v":""},1,9,0,null,null,null,null,null,null,null,null,null,{"$f":"IF(AND(AR$1=$AO2,AR$32=$AQ2),$ZL2,\"\")","v":""},{"$f":"IF(AND(AS$1=$AO2,AS$32=$AQ2),$ZL2,\"\")","v":""},{"$f":"IF(AND(AT$1=$AO2,AT$32=$AQ2),$ZL2,\"\")","v":""},{"$f":"IF(AND(AU$1=$AO2,AU$32=$AQ2),$ZL2,\"\")","v":""},{"$f":"IF(AND(AV$1=$AO2,AV$32=$AQ2),$ZL2,\"\")","v":""},{"$f":"IF(AND(AW$1=$AO2,AW$32=$AQ2),$ZL2,\"\")","v":""},{"$f":"IF(AND(AX$1=$AO2,AX$32=$AQ2),$ZL2,\"\")","v":""},{"$f":"IF(AND(AY$1=$AO2,AY$32=$AQ2),$ZL2,\"\")","v":""},{"$f":"IF(AND(AZ$1=$AO2,AZ$32=$AQ2),$ZL2,\"\")","v":""},{"$f":"IF(AND(BA$1=$AO2,BA$32=$AQ2),$ZL2,\"\")","v":""},{"$f":"IF(AND(BB$1=$AO2,BB$32=$AQ2),$ZL2,\"\")","v":""},{"$f":"IF(AND(BC$1=$AO2,BC$32=$AQ2),$ZL2,\"\")","v":""},{"$f":"IF(AND(BD$1=$AO2,BD$32=$AQ2),$ZL2,\"\")","v":""},{"$f":"IF(AND(BE$1=$AO2,BE$32=$AQ2),$ZL2,\"\")","v":""},{"$f":"IF(AND(BF$1=$AO2,BF$32=$AQ2),$ZL2,\"\")","v":""},{"$f":"IF(AND(BG$1=$AO2,BG$32=$AQ2),$ZL2,\"\")","v":""},{"$f":"IF(AND(BH$1=$AO2,BH$32=$AQ2),$ZL2,\"\")","v":""},{"$f":"IF(AND(BI$1=$AO2,BI$32=$AQ2),$ZL2,\"\")","v":""},{"$f":"IF(AND(BJ$1=$AO2,BJ$32=$AQ2),$ZL2,\"\")","v":""},{"$f":"IF(AND(BK$1=$AO2,BK$32=$AQ2),$ZL2,\"\")","v":""},{"$f":"IF(AND(BL$1=$AO2,BL$32=$AQ2),$ZL2,\"\")","v":""},{"$f":"IF(AND(BM$1=$AO2,BM$32=$AQ2),$ZL2,\"\")","v":""},{"$f":"IF(AND(BN$1=$AO2,BN$32=$AQ2),$ZL2,\"\")","v":""},{"$f":"IF(AND(BO$1=$AO2,BO$32=$AQ2),$ZL2,\"\")","v":""},{"$f":"IF(AND(BP$1=$AO2,BP$32=$AQ2),$ZL2,\"\")","v":""},{"$f":"IF(AND(BQ$1=$AO2,BQ$32=$AQ2),$ZL2,\"\")","v":""},{"$f":"IF(AND(BR$1=$AO2,BR$32=$AQ2),$ZL2,\"\")","v":""},{"$f":"IF(AND(BS$1=$AO2,BS$32=$AQ2),$ZL2,\"\")","v":""},{"$f":"IF(AND(BT$1=$AO2,BT$32=$AQ2),$ZL2,\"\")","v":""},{"$f":"IF(AND(BU$1=$AO2,BU$32=$AQ2),$ZL2,\"\")","v":""},{"$f":"IF(AND(BV$1=$AO2,BV$32=$AQ2),$ZL2,\"\")","v":""},{"$f":"IF(AND(BW$1=$AO2,BW$32=$AQ2),$ZL2,\"\")","v":""},{"$f":"IF(AND(BX$1=$AO2,BX$32=$AQ2),$ZL2,\"\")","v":""},{"$f":"IF(AND(BY$1=$AO2,BY$32=$AQ2),$ZL2,\"\")","v":""},{"$f":"IF(AND(BZ$1=$AO2,BZ$32=$AQ2),$ZL2,\"\")","v":""},{"$f":"IF(AND(CA$1=$AO2,CA$32=$AQ2),$ZL2,\"\")","v":""},{"$f":"IF(AND(CB$1=$AO2,CB$32=$AQ2),$ZL2,\"\")","v":""},{"$f":"IF(AND(CC$1=$AO2,CC$32=$AQ2),$ZL2,\"\")","v":""},{"$f":"IF(AND(CD$1=$AO2,CD$32=$AQ2),$ZL2,\"\")","v":""},{"$f":"IF(AND(CE$1=$AO2,CE$32=$AQ2),$ZL2,\"\")","v":""},{"$f":"IF(AND(CF$1=$AO2,CF$32=$AQ2),$ZL2,\"\")","v":""},{"$f":"IF(AND(CG$1=$AO2,CG$32=$AQ2),$ZL2,\"\")","v":""},{"$f":"IF(AND(CH$1=$AO2,CH$32=$AQ2),$ZL2,\"\")","v":""},{"$f":"IF(AND(CI$1=$AO2,CI$32=$AQ2),$ZL2,\"\")","v":""},{"$f":"IF(AND(CJ$1=$AO2,CJ$32=$AQ2),$ZL2,\"\")","v":""},{"$f":"IF(AND(CK$1=$AO2,CK$32=$AQ2),$ZL2,\"\")","v":""},{"$f":"IF(AND(CL$1=$AO2,CL$32=$AQ2),$ZL2,\"\")","v":""},{"$f":"IF(AND(CM$1=$AO2,CM$32=$AQ2),$ZL2,\"\")","v":""},{"$f":"IF(AND(CN$1=$AO2,CN$32=$AQ2),$ZL2,\"\")","v":""},{"$f":"IF(AND(CO$1=$AO2,CO$32=$AQ2),$ZL2,\"\")","v":""},{"$f":"IF(AND(CP$1=$AO2,CP$32=$AQ2),$ZL2,\"\")","v":""},{"$f":"IF(AND(CQ$1=$AO2,CQ$32=$AQ2),$ZL2,\"\")","v":""},{"$f":"IF(AND(CR$1=$AO2,CR$32=$AQ2),$ZL2,\"\")","v":""},{"$f":"IF(AND(CS$1=$AO2,CS$32=$AQ2),$ZL2,\"\")","v":3},{"$f":"IF(AND(CT$1=$AO2,CT$32=$AQ2),$ZL2,\"\")","v":""},{"$f":"IF(AND(CU$1=$AO2,CU$32=$AQ2),$ZL2,\"\")","v":""},{"$f":"IF(AND(CV$1=$AO2,CV$32=$AQ2),$ZL2,\"\")","v":""},{"$f":"IF(AND(CW$1=$AO2,CW$32=$AQ2),$ZL2,\"\")","v":""},{"$f":"IF(AND(CX$1=$AO2,CX$32=$AQ2),$ZL2,\"\")","v":""},{"$f":"IF(AND(CY$1=$AO2,CY$32=$AQ2),$ZL2,\"\")","v":""},{"$f":"IF(AND(CZ$1=$AO2,CZ$32=$AQ2),$ZL2,\"\")","v":""},{"$f":"IF(AND(DA$1=$AO2,DA$32=$AQ2),$ZL2,\"\")","v":""},{"$f":"IF(AND(DB$1=$AO2,DB$32=$AQ2),$ZL2,\"\")","v":""},{"$f":"IF(AND(DC$1=$AO2,DC$32=$AQ2),$ZL2,\"\")","v":""},{"$f":"IF(AND(DD$1=$AO2,DD$32=$AQ2),$ZL2,\"\")","v":""},{"$f":"IF(AND(DE$1=$AO2,DE$32=$AQ2),$ZL2,\"\")","v":""},{"$f":"IF(AND(DF$1=$AO2,DF$32=$AQ2),$ZL2,\"\")","v":""},{"$f":"IF(AND(DG$1=$AO2,DG$32=$AQ2),$ZL2,\"\")","v":""},{"$f":"IF(AND(DH$1=$AO2,DH$32=$AQ2),$ZL2,\"\")","v":""},{"$f":"IF(AND(DI$1=$AO2,DI$32=$AQ2),$ZL2,\"\")","v":""},{"$f":"IF(AND(DJ$1=$AO2,DJ$32=$AQ2),$ZL2,\"\")","v":""},{"$f":"IF(AND(DK$1=$AO2,DK$32=$AQ2),$ZL2,\"\")","v":""},{"$f":"IF(AND(DL$1=$AO2,DL$32=$AQ2),$ZL2,\"\")","v":""},{"$f":"IF(AND(DM$1=$AO2,DM$32=$AQ2),$ZL2,\"\")","v":""},{"$f":"IF(AND(DN$1=$AO2,DN$32=$AQ2),$ZL2,\"\")","v":""},{"$f":"IF(AND(DO$1=$AO2,DO$32=$AQ2),$ZL2,\"\")","v":""},{"$f":"IF(AND(DP$1=$AO2,DP$32=$AQ2),$ZL2,\"\")","v":""},{"$f":"IF(AND(DQ$1=$AO2,DQ$32=$AQ2),$ZL2,\"\")","v":""},{"$f":"IF(AND(DR$1=$AO2,DR$32=$AQ2),$ZL2,\"\")","v":""},{"$f":"IF(AND(DS$1=$AO2,DS$32=$AQ2),$ZL2,\"\")","v":""},{"$f":"IF(AND(DT$1=$AO2,DT$32=$AQ2),$ZL2,\"\")","v":""},{"$f":"IF(AND(DU$1=$AO2,DU$32=$AQ2),$ZL2,\"\")","v":""},{"$f":"IF(AND(DV$1=$AO2,DV$32=$AQ2),$ZL2,\"\")","v":""},{"$f":"IF(AND(DW$1=$AO2,DW$32=$AQ2),$ZL2,\"\")","v":""},{"$f":"IF(AND(DX$1=$AO2,DX$32=$AQ2),$ZL2,\"\")","v":""},{"$f":"IF(AND(DY$1=$AO2,DY$32=$AQ2),$ZL2,\"\")","v":""},{"$f":"IF(AND(DZ$1=$AO2,DZ$32=$AQ2),$ZL2,\"\")","v":""},{"$f":"IF(AND(EA$1=$AO2,EA$32=$AQ2),$ZL2,\"\")","v":""},{"$f":"IF(AND(EB$1=$AO2,EB$32=$AQ2),$ZL2,\"\")","v":""},{"$f":"IF(AND(EC$1=$AO2,EC$32=$AQ2),$ZL2,\"\")","v":""},{"$f":"IF(AND(ED$1=$AO2,ED$32=$AQ2),$ZL2,\"\")","v":""},{"$f":"IF(AND(EE$1=$AO2,EE$32=$AQ2),$ZL2,\"\")","v":""},{"$f":"IF(AND(EF$1=$AO2,EF$32=$AQ2),$ZL2,\"\")","v":""},{"$f":"IF(AND(EG$1=$AO2,EG$32=$AQ2),$ZL2,\"\")","v":""},{"$f":"IF(AND(EH$1=$AO2,EH$32=$AQ2),$ZL2,\"\")","v":""},{"$f":"IF(AND(EI$1=$AO2,EI$32=$AQ2),$ZL2,\"\")","v":""},{"$f":"IF(AND(EJ$1=$AO2,EJ$32=$AQ2),$ZL2,\"\")","v":""},{"$f":"IF(AND(EK$1=$AO2,EK$32=$AQ2),$ZL2,\"\")","v":""},{"$f":"IF(AND(EL$1=$AO2,EL$32=$AQ2),$ZL2,\"\")","v":""},{"$f":"IF(AND(EM$1=$AO2,EM$32=$AQ2),$ZL2,\"\")","v":""},{"$f":"IF(AND(EN$1=$AO2,EN$32=$AQ2),$ZL2,\"\")","v":""},{"$f":"IF(AND(EO$1=$AO2,EO$32=$AQ2),$ZL2,\"\")","v":""},{"$f":"IF(AND(EP$1=$AO2,EP$32=$AQ2),$ZL2,\"\")","v":""},{"$f":"IF(AND(EQ$1=$AO2,EQ$32=$AQ2),$ZL2,\"\")","v":""},{"$f":"IF(AND(ER$1=$AO2,ER$32=$AQ2),$ZL2,\"\")","v":""},{"$f":"IF(AND(ES$1=$AO2,ES$32=$AQ2),$ZL2,\"\")","v":""},{"$f":"IF(AND(ET$1=$AO2,ET$32=$AQ2),$ZL2,\"\")","v":""},{"$f":"IF(AND(EU$1=$AO2,EU$32=$AQ2),$ZL2,\"\")","v":""},{"$f":"IF(AND(EV$1=$AO2,EV$32=$AQ2),$ZL2,\"\")","v":""},{"$f":"IF(AND(EW$1=$AO2,EW$32=$AQ2),$ZL2,\"\")","v":""},{"$f":"IF(AND(EX$1=$AO2,EX$32=$AQ2),$ZL2,\"\")","v":""},{"$f":"IF(AND(EY$1=$AO2,EY$32=$AQ2),$ZL2,\"\")","v":""},{"$f":"IF(AND(EZ$1=$AO2,EZ$32=$AQ2),$ZL2,\"\")","v":""},{"$f":"IF(AND(FA$1=$AO2,FA$32=$AQ2),$ZL2,\"\")","v":""},{"$f":"IF(AND(FB$1=$AO2,FB$32=$AQ2),$ZL2,\"\")","v":""},{"$f":"IF(AND(FC$1=$AO2,FC$32=$AQ2),$ZL2,\"\")","v":""},{"$f":"IF(AND(FD$1=$AO2,FD$32=$AQ2),$ZL2,\"\")","v":""},{"$f":"IF(AND(FE$1=$AO2,FE$32=$AQ2),$ZL2,\"\")","v":""},{"$f":"IF(AND(FF$1=$AO2,FF$32=$AQ2),$ZL2,\"\")","v":""},{"$f":"IF(AND(FG$1=$AO2,FG$32=$AQ2),$ZL2,\"\")","v":""},{"$f":"IF(AND(FH$1=$AO2,FH$32=$AQ2),$ZL2,\"\")","v":""},{"$f":"IF(AND(FI$1=$AO2,FI$32=$AQ2),$ZL2,\"\")","v":""},{"$f":"IF(AND(FJ$1=$AO2,FJ$32=$AQ2),$ZL2,\"\")","v":""},{"$f":"IF(AND(FK$1=$AO2,FK$32=$AQ2),$ZL2,\"\")","v":""},{"$f":"IF(AND(FL$1=$AO2,FL$32=$AQ2),$ZL2,\"\")","v":""},{"$f":"IF(AND(FM$1=$AO2,FM$32=$AQ2),$ZL2,\"\")","v":""},{"$f":"IF(AND(FN$1=$AO2,FN$32=$AQ2),$ZL2,\"\")","v":""},{"$f":"IF(AND(FO$1=$AO2,FO$32=$AQ2),$ZL2,\"\")","v":""},{"$f":"IF(AND(FP$1=$AO2,FP$32=$AQ2),$ZL2,\"\")","v":""},{"$f":"IF(AND(FQ$1=$AO2,FQ$32=$AQ2),$ZL2,\"\")","v":""},{"$f":"IF(AND(FR$1=$AO2,FR$32=$AQ2),$ZL2,\"\")","v":""},{"$f":"IF(AND(FS$1=$AO2,FS$32=$AQ2),$ZL2,\"\")","v":""},{"$f":"IF(AND(FT$1=$AO2,FT$32=$AQ2),$ZL2,\"\")","v":""},{"$f":"IF(AND(FU$1=$AO2,FU$32=$AQ2),$ZL2,\"\")","v":""},{"$f":"IF(AND(FV$1=$AO2,FV$32=$AQ2),$ZL2,\"\")","v":""},{"$f":"IF(AND(FW$1=$AO2,FW$32=$AQ2),$ZL2,\"\")","v":""},{"$f":"IF(AND(FX$1=$AO2,FX$32=$AQ2),$ZL2,\"\")","v":""},{"$f":"IF(AND(FY$1=$AO2,FY$32=$AQ2),$ZL2,\"\")","v":""},{"$f":"IF(AND(FZ$1=$AO2,FZ$32=$AQ2),$ZL2,\"\")","v":""},{"$f":"IF(AND(GA$1=$AO2,GA$32=$AQ2),$ZL2,\"\")","v":""},{"$f":"IF(AND(GB$1=$AO2,GB$32=$AQ2),$ZL2,\"\")","v":""},{"$f":"IF(AND(GC$1=$AO2,GC$32=$AQ2),$ZL2,\"\")","v":""},{"$f":"IF(AND(GD$1=$AO2,GD$32=$AQ2),$ZL2,\"\")","v":""},{"$f":"IF(AND(GE$1=$AO2,GE$32=$AQ2),$ZL2,\"\")","v":""},{"$f":"IF(AND(GF$1=$AO2,GF$32=$AQ2),$ZL2,\"\")","v":""},{"$f":"IF(AND(GG$1=$AO2,GG$32=$AQ2),$ZL2,\"\")","v":""},{"$f":"IF(AND(GH$1=$AO2,GH$32=$AQ2),$ZL2,\"\")","v":""},{"$f":"IF(AND(GI$1=$AO2,GI$32=$AQ2),$ZL2,\"\")","v":""},{"$f":"IF(AND(GJ$1=$AO2,GJ$32=$AQ2),$ZL2,\"\")","v":""},{"$f":"IF(AND(GK$1=$AO2,GK$32=$AQ2),$ZL2,\"\")","v":""},{"$f":"IF(AND(GL$1=$AO2,GL$32=$AQ2),$ZL2,\"\")","v":""},{"$f":"IF(AND(GM$1=$AO2,GM$32=$AQ2),$ZL2,\"\")","v":""},{"$f":"IF(AND(GN$1=$AO2,GN$32=$AQ2),$ZL2,\"\")","v":""},{"$f":"IF(AND(GO$1=$AO2,GO$32=$AQ2),$ZL2,\"\")","v":""},{"$f":"IF(AND(GP$1=$AO2,GP$32=$AQ2),$ZL2,\"\")","v":""},{"$f":"IF(AND(GQ$1=$AO2,GQ$32=$AQ2),$ZL2,\"\")","v":""},{"$f":"IF(AND(GR$1=$AO2,GR$32=$AQ2),$ZL2,\"\")","v":""},{"$f":"IF(AND(GS$1=$AO2,GS$32=$AQ2),$ZL2,\"\")","v":""},{"$f":"IF(AND(GT$1=$AO2,GT$32=$AQ2),$ZL2,\"\")","v":""},{"$f":"IF(AND(GU$1=$AO2,GU$32=$AQ2),$ZL2,\"\")","v":""},{"$f":"IF(AND(GV$1=$AO2,GV$32=$AQ2),$ZL2,\"\")","v":""},{"$f":"IF(AND(GW$1=$AO2,GW$32=$AQ2),$ZL2,\"\")","v":""},{"$f":"IF(AND(GX$1=$AO2,GX$32=$AQ2),$ZL2,\"\")","v":""},{"$f":"IF(AND(GY$1=$AO2,GY$32=$AQ2),$ZL2,\"\")","v":""},{"$f":"IF(AND(GZ$1=$AO2,GZ$32=$AQ2),$ZL2,\"\")","v":""},{"$f":"IF(AND(HA$1=$AO2,HA$32=$AQ2),$ZL2,\"\")","v":""},{"$f":"IF(AND(HB$1=$AO2,HB$32=$AQ2),$ZL2,\"\")","v":""},{"$f":"IF(AND(HC$1=$AO2,HC$32=$AQ2),$ZL2,\"\")","v":""},{"$f":"IF(AND(HD$1=$AO2,HD$32=$AQ2),$ZL2,\"\")","v":""},{"$f":"IF(AND(HE$1=$AO2,HE$32=$AQ2),$ZL2,\"\")","v":""},{"$f":"IF(AND(HF$1=$AO2,HF$32=$AQ2),$ZL2,\"\")","v":""},{"$f":"IF(AND(HG$1=$AO2,HG$32=$AQ2),$ZL2,\"\")","v":""},{"$f":"IF(AND(HH$1=$AO2,HH$32=$AQ2),$ZL2,\"\")","v":""},{"$f":"IF(AND(HI$1=$AO2,HI$32=$AQ2),$ZL2,\"\")","v":""},{"$f":"IF(AND(HJ$1=$AO2,HJ$32=$AQ2),$ZL2,\"\")","v":""},{"$f":"IF(AND(HK$1=$AO2,HK$32=$AQ2),$ZL2,\"\")","v":""},{"$f":"IF(AND(HL$1=$AO2,HL$32=$AQ2),$ZL2,\"\")","v":""},{"$f":"IF(AND(HM$1=$AO2,HM$32=$AQ2),$ZL2,\"\")","v":""},{"$f":"IF(AND(HN$1=$AO2,HN$32=$AQ2),$ZL2,\"\")","v":""},{"$f":"IF(AND(HO$1=$AO2,HO$32=$AQ2),$ZL2,\"\")","v":""},{"$f":"IF(AND(HP$1=$AO2,HP$32=$AQ2),$ZL2,\"\")","v":""},{"$f":"IF(AND(HQ$1=$AO2,HQ$32=$AQ2),$ZL2,\"\")","v":""},{"$f":"IF(AND(HR$1=$AO2,HR$32=$AQ2),$ZL2,\"\")","v":""},{"$f":"IF(AND(HS$1=$AO2,HS$32=$AQ2),$ZL2,\"\")","v":""},{"$f":"IF(AND(HT$1=$AO2,HT$32=$AQ2),$ZL2,\"\")","v":""},{"$f":"IF(AND(HU$1=$AO2,HU$32=$AQ2),$ZL2,\"\")","v":""},{"$f":"IF(AND(HV$1=$AO2,HV$32=$AQ2),$ZL2,\"\")","v":""},{"$f":"IF(AND(HW$1=$AO2,HW$32=$AQ2),$ZL2,\"\")","v":""},{"$f":"IF(AND(HX$1=$AO2,HX$32=$AQ2),$ZL2,\"\")","v":""},{"$f":"IF(AND(HY$1=$AO2,HY$32=$AQ2),$ZL2,\"\")","v":""},{"$f":"IF(AND(HZ$1=$AO2,HZ$32=$AQ2),$ZL2,\"\")","v":""},{"$f":"IF(AND(IA$1=$AO2,IA$32=$AQ2),$ZL2,\"\")","v":""},{"$f":"IF(AND(IB$1=$AO2,IB$32=$AQ2),$ZL2,\"\")","v":""},{"$f":"IF(AND(IC$1=$AO2,IC$32=$AQ2),$ZL2,\"\")","v":""},{"$f":"IF(AND(ID$1=$AO2,ID$32=$AQ2),$ZL2,\"\")","v":""},{"$f":"IF(AND(IE$1=$AO2,IE$32=$AQ2),$ZL2,\"\")","v":""},{"$f":"IF(AND(IF$1=$AO2,IF$32=$AQ2),$ZL2,\"\")","v":""},{"$f":"IF(AND(IG$1=$AO2,IG$32=$AQ2),$ZL2,\"\")","v":""},{"$f":"IF(AND(IH$1=$AO2,IH$32=$AQ2),$ZL2,\"\")","v":""},{"$f":"IF(AND(II$1=$AO2,II$32=$AQ2),$ZL2,\"\")","v":""},null,{"$f":"IF(ZM2=\"A\",0,ZM2)","v":""},{"$f":"IF(ZN2=\"A\",0,ZN2)","v":""},"","","","","","","","","","","","","","","","","","","","","","","","","","","","","","","","",""]
[null,14,2,null,null,null,null,null,null,null,null,null,null,null,null,null,null,null,null,null,null,null,null,null,null,null,null,null,null,null,null,null,null,null,null,null,null,null,null,"",14,"Comprendre et utiliser des nombres entiers pour dénombrer, ordonner, repérer, comparer.",1,"","","","","","","","","","","","","","","","","","","","","","","","","","","","","","","","","","","","","","","","","","","","","","","","","","","","","","","","","","","","","","","","","","","","","","","","","","","","","","","","","","","","","","","","","","","","","","","","","","","","","","","","","","","","","","","","","","","","","","","","","","","","","","","","","","","","","","","","","","","","","","","","","","","","","","","","","","","","","","","","","","","","","","","","","","","","","","","","","","","","","","","","","","","","","","","","","","","","","","","","","",14,"Comprendre et utiliser des nombres entiers pour dénombrer, ordonner, repérer, comparer.",1,"","","","","","","","","","","","","","","","","","","","","","","","","","","","","","","","","","","","","","","","","","","","","","","","","","","","","","","","","","","","","","","","","","","","","","","","","","","","","","","","","","","","","","","","","","","","","","","","","","","","","","","","","","","","","","","","","","","","","","","","","","","","","","","","","","","","","","","","","","","","","","","","","","","","","","","","","","","","","","","","","","","","","","","","","","","","","","","","","","","","","","","","","","","","","","","","","","","","","","","","","",14,"Comprendre et utiliser des nombres entiers pour dénombrer, ordonner, repérer, comparer.",1,"","","","","","","","","","","","","","","","","","","","","","","","","","","","","","","","","","","","","","","","","","","","","","","","","","","","","","","","","","","","","","","","","","","","","","","","","","","","","","","","","","","","","","","","","","","","","","","","","","","","","","","","","","","","","","","","","","","","","","","","","","","","","","","","","","","","","","","","","","","","","","","","","","","","","","","","","","","","","","","","","","","","","","","","","","","","","","","","","","","","","","","","","","","","","","","","","","","","","","","","",null,null,null,null,null,null,null,null,null,null,null,null,null,null,null,null,null,null,null,null,null,null,null,null,null,null,null,null,null,null,null,null,null,null,null,{"$f":"IF(OR(ISBLANK(INDEX(liste_des_resultats,ROW()-1,CELL(\"contenu\",'Bilan - élève'!$J$1))),ISERROR(INDEX(liste_des_resultats,ROW()-1,CELL(\"contenu\",'Bilan - élève'!$J$1)))),\"\",INDEX(liste_des_resultats,ROW()-1,CELL(\"contenu\",'Bilan - élève'!$J$1)))","v":""},3,"","","","","","","","","","","","","","","","","","","","","","","","","","","","","","","","","","","",1,9,0,null,null,null,null,null,null,null,null,null,"","","","","","","","","","","","","","","","","","","","","","","","","","","","","","","","","","","","","","","","","","","","","","","","","","","","",3,"","","","","","","","","","","","","","","","","","","","","","","","","","","","","","","","","","","","","","","","","","","","","","","","","","","","","","","","","","","","","","","","","","","","","","","","","","","","","","","","","","","","","","","","","","","","","","","","","","","","","","","","","","","","","","","","","","","","","","","","","","","","","","","","","","","","","","","","","","","","","","","","","","","",null,"",{"$f":"IF(ZN3=\"A\",0,ZN3)","v":""},{"$f":"IF(ZO3=\"A\",0,ZO3)","v":""},{"$f":"IF(ZP3=\"A\",0,ZP3)","v":""},{"$f":"IF(ZQ3=\"A\",0,ZQ3)","v":""},{"$f":"IF(ZR3=\"A\",0,ZR3)","v":""},{"$f":"IF(ZS3=\"A\",0,ZS3)","v":""},{"$f":"IF(ZT3=\"A\",0,ZT3)","v":""},{"$f":"IF(ZU3=\"A\",0,ZU3)","v":""},{"$f":"IF(ZV3=\"A\",0,ZV3)","v":""},{"$f":"IF(ZW3=\"A\",0,ZW3)","v":""},{"$f":"IF(ZX3=\"A\",0,ZX3)","v":""},{"$f":"IF(ZY3=\"A\",0,ZY3)","v":""},{"$f":"IF(ZZ3=\"A\",0,ZZ3)","v":""},{"$f":"IF(AAA3=\"A\",0,AAA3)","v":""},{"$f":"IF(AAB3=\"A\",0,AAB3)","v":""},{"$f":"IF(AAC3=\"A\",0,AAC3)","v":""},{"$f":"IF(AAD3=\"A\",0,AAD3)","v":""},{"$f":"IF(AAE3=\"A\",0,AAE3)","v":""},{"$f":"IF(AAF3=\"A\",0,AAF3)","v":""},{"$f":"IF(AAG3=\"A\",0,AAG3)","v":""},{"$f":"IF(AAH3=\"A\",0,AAH3)","v":""},{"$f":"IF(AAI3=\"A\",0,AAI3)","v":""},{"$f":"IF(AAJ3=\"A\",0,AAJ3)","v":""},{"$f":"IF(AAK3=\"A\",0,AAK3)","v":""},{"$f":"IF(AAL3=\"A\",0,AAL3)","v":""},{"$f":"IF(AAM3=\"A\",0,AAM3)","v":""},{"$f":"IF(AAN3=\"A\",0,AAN3)","v":""},{"$f":"IF(AAO3=\"A\",0,AAO3)","v":""},{"$f":"IF(AAP3=\"A\",0,AAP3)","v":""},{"$f":"IF(AAQ3=\"A\",0,AAQ3)","v":""},{"$f":"IF(AAR3=\"A\",0,AAR3)","v":""},{"$f":"IF(AAS3=\"A\",0,AAS3)","v":""},{"$f":"IF(AAT3=\"A\",0,AAT3)","v":""},{"$f":"IF(AAU3=\"A\",0,AAU3)","v":""}]
[null,15,3,null,null,null,null,null,null,null,null,null,null,null,null,null,null,null,null,null,null,null,null,null,null,null,null,null,null,null,null,null,null,null,null,null,null,null,null,"",15,"Nommer, lire, écrire, représenter des nombres entiers.",1,"","","","","","","","","","","","","","","","","","","","","","","","","","","","","","","","","","","","","","","","","","","","","","","","","","","","","","","","","","","","","","","","","","","","","","","","","","","","","","","","","","","","","","","","","","","","","","","","","","","","","","","","","","","","","","","","","","","","","","","","","","","","","","","","","","","","","","","","","","","","","","","","","","","","","","","","","","","","","","","","","","","","","","","","","","","","","","","","","","","","","","","","","","","","","","","","","","","","","","","","","",15,"Nommer, lire, écrire, représenter des nombres entiers.",1,"","","","","","","","","","","","","","","","","","","","","","","","","","","","","","","","","","","","","","","","","","","","","","","","","","","","","","","","","","","","","","","","","","","","","","","","","","","","","","","","","","","","","","","","","","","","","","","","","","","","","","","","","","","","","","","","","","","","","","","","","","","","","","","","","","","","","","","","","","","","","","","","","","","","","","","","","","","","","","","","","","","","","","","","","","","","","","","","","","","","","","","","","","","","","","","","","","","","","","","","","",15,"Nommer, lire, écrire, représenter des nombres entiers.",1,"","","","","","","","","","","","","","","","","","","","","","","","","","","","","","","","","","","","","","","","","","","","","","","","","","","","","","","","","","","","","","","","","","","","","","","","","","","","","","","","","","","","","","","","","","","","","","","","","","","","","","","","","","","","","","","","","","","","","","","","","","","","","","","","","","","","","","","","","","","","","","","","","","","","","","","","","","","","","","","","","","","","","","","","","","","","","","","","","","","","","","","","","","","","","","","","","","","","","","","","",null,null,null,null,null,null,null,null,null,null,null,null,null,null,null,null,null,null,null,null,null,null,null,null,null,null,null,null,null,null,null,null,null,null,null,{"$f":"IF(OR(ISBLANK(INDEX(liste_des_resultats,ROW()-1,CELL(\"contenu\",'Bilan - élève'!$J$1))),ISERROR(INDEX(liste_des_resultats,ROW()-1,CELL(\"contenu\",'Bilan - élève'!$J$1)))),\"\",INDEX(liste_des_resultats,ROW()-1,CELL(\"contenu\",'Bilan - élève'!$J$1)))","v":""},3,"","","","","","","","","","","","","","","","","","","","","","","","","","","","","","","","","","","",1,2,9,0,null,null,null,null,null,null,null,null,"","","","","","","","","","","","","","","","","","","","","","","","","","","","","","","","","","","","","","","","","","","","","","","","","","","","","","","","",3,"","","","","","","","","","","","","","","","","","","","","","","","","","","","","","","","","","","","","","","","","","","","","","","","","","","","","","","","","","","","","","","","","","","","","","","","","","","","","","","","","","","","","","","","","","","","","","","","","","","","","","","","","","","","","","","","","","","","","","","","","","","","","","","","","","","","","","","","","","","","","","","",null,"","","","","","","","","","","","","","","","","","","","","","","","","","","","","","","","","","",""]
[2,17,4,null,null,null,null,null,null,null,null,null,null,null,null,null,null,null,null,null,null,null,null,null,null,null,null,null,null,null,null,null,null,null,null,null,null,null,null,"",17,"Calculer avec des nombres entiers.",2,"","","","","","","","","","","","","","","","","","","","","","","","","","","","","","","","","","","","","","","","","","","","","","","","","","","","","","","","","","","","","","","","","","","","","","","","","","","","","","","","","","","","","","","","","","","","","","","","","","","","","","","","","","","","","","","","","","","","","","","","","","","","","","","","","","","","","","","","","","","","","","","","","","","","","","","","","","","","","","","","","","","","","","","","","","","","","","","","","","","","","","","","","","","","","","","","","","","","","","","","","",17,"Calculer avec des nombres entiers.",2,"","","","","","","","","","","","","","","","","","","","","","","","","","","","","","","","","","","","","","","","","","","","","","","","","","","","","","","","","","","","","","","","","","","","","","","","","","","","","","","","","","","","","","","","","","","","","","","","","","","","","","","","","","","","","","","","","","","","","","","","","","","","","","","","","","","","","","","","","","","","","","","","","","","","","","","","","","","","","","","","","","","","","","","","","","","","","","","","","","","","","","","","","","","","","","","","","","","","","","","","","",17,"Calculer avec des nombres entiers.",2,"","","","","","","","","","","","","","","","","","","","","","","","","","","","","","","","","","","","","","","","","","","","","","","","","","","","","","","","","","","","","","","","","","","","","","","","","","","","","","","","","","","","","","","","","","","","","","","","","","","","","","","","","","","","","","","","","","","","","","","","","","","","","","","","","","","","","","","","","","","","","","","","","","","","","","","","","","","","","","","","","","","","","","","","","","","","","","","","","","","","","","","","","","","","","","","","","","","","","","","","",null,null,null,null,null,null,null,null,null,null,null,null,null,null,null,null,null,null,null,null,null,null,null,null,null,null,null,null,null,null,null,null,null,null,null,{"$f":"IF(OR(ISBLANK(INDEX(liste_des_resultats,ROW()-1,CELL(\"contenu\",'Bilan - élève'!$J$1))),ISERROR(INDEX(liste_des_resultats,ROW()-1,CELL(\"contenu\",'Bilan - élève'!$J$1)))),\"\",INDEX(liste_des_resultats,ROW()-1,CELL(\"contenu\",'Bilan - élève'!$J$1)))","v":""},3,"",{"$f":"IF(F5=1,3,IF(F5=2,2,IF(F5=8,1,IF(F5=9,0,IF(ISBLANK(F5),\"\",IF(F5=0,\"A\"))))))","v":""},"","","","","","","","","","","","","","","","","","","","","","","","","","","","","","","","","",1,2,9,0,null,null,null,null,null,null,null,null,"","","","","","","","","","","","","","","","","","","","","","","","","","","","","","","","","","","","","","","","","","","","","","","","","","","","","","","","","","","","","","","","","",3,"","","","","","","","","","","","","","","","","","","","","","","","","","","","","","","","","","","","","","","","","","","","","","","","","","","","","","","","","","","","","","","","","","","","","","","","","","","","","","","","","","","","","","","","","","","","","","","","","","","","","","","","","","","","","","","","","","","","","","","","","","","","","","","","","","","","","","",null,"","","","","","","","","","","","","","","","","","","","","","","","","","","","","","","","","","",""]
[null,16,5,null,null,null,null,null,null,null,null,null,null,null,null,null,null,null,null,null,null,null,null,null,null,null,null,null,null,null,null,null,null,null,null,null,null,null,null,"",16,"Résoudre des problèmes en utilisant des nombres entiers et le calcul.",2,"","","","","","","","","","","","","","","","","","","","","","","","","","","","","","","","","","","","","","","","","","","","","","","","","","","","","","","","","","","","","","","","","","","","","","","","","","","","","","","","","","","","","","","","","","","","","","","","","","","","","","","","","","","","","","","","","","","","","","","","","","","","","","","","","","","","","","","","","","","","","","","","","","","","","","","","","","","","","","","","","","","","","","","","","","","","","","","","","","","","","","","","","","","","","","","","","","","","","","","","","",16,"Résoudre des problèmes en utilisant des nombres entiers et le calcul.",2,"","","","","","","","","","","","","","","","","","","","","","","","","","","","","","","","","","","","","","","","","","","","","","","","","","","","","","","","","","","","","","","","","","","","","","","","","","","","","","","","","","","","","","","","","","","","","","","","","","","","","","","","","","","","","","","","","","","","","","","","","","","","","","","","","","","","","","","","","","","","","","","","","","","","","","","","","","","","","","","","","","","","","","","","","","","","","","","","","","","","","","","","","","","","","","","","","","","","","","","","","",16,"Résoudre des problèmes en utilisant des nombres entiers et le calcul.",2,"","","","","","","","","","","","","","","","","","","","","","","","","","","","","","","","","","","","","","","","","","","","","","","","","","","","","","","","","","","","","","","","","","","","","","","","","","","","","","","","","","","","","","","","","","","","","","","","","","","","","","","","","","","","","","","","","","","","","","","","","","","","","","","","","","","","","","","","","","","","","","","","","","","","","","","","","","","","","","","","","","","","","","","","","","","","","","","","","","","","","","","","","","","","","","","","","","","","","","","","",{"$f":"IF(COUNT(E6,E8,E11)=0,\"\",SUM(ZM6,ZM8,ZM11)/($ZL6*COUNT(E6,E8,E11)))","v":""},{"$f":"IF(COUNT(F6,F8,F11)=0,\"\",SUM(ZN6,ZN8,ZN11)/($ZL6*COUNT(F6,F8,F11)))","v":""},"","","","","","","","","","","","","","","","","","","","","","","","","","","","","","","","","",{"$f":"IF(OR(ISBLANK(INDEX(liste_des_resultats,ROW()-1,CELL(\"contenu\",'Bilan - élève'!$J$1))),ISERROR(INDEX(liste_des_resultats,ROW()-1,CELL(\"contenu\",'Bilan - élève'!$J$1)))),\"\",INDEX(liste_des_resultats,ROW()-1,CELL(\"contenu\",'Bilan - élève'!$J$1)))","v":""},3,"","","","","","","","","","","","","","","","","","","","","","","","","","","","","","","","","","","",1,2,8,9,0,null,null,null,null,null,null,null,"","","","","","","","","","","","","","","","","","","","","","","","","","","","","","","","","","","","","","","","","","","","","","","","","","","","","","","","","","","","","",3,"","","","","","","","","","","","","","","","","","","","","","","","","","","","","","","","","","","","","","","","","","","","","","","","","","","","","","","","","","","","","","","","","","","","","","","","","","","","","","","","","","","","","","","","","","","","","","","","","","","","","","","","","","","","","","","","","","","","","","","","","","","","","","","","","","","","","","","","","","",null,"","","","","","","","","","","","","","","","","","","","","","","","","","","","","","","","","","",""]
[null,16,6,null,null,null,null,null,null,null,null,null,null,null,null,null,null,null,null,null,null,null,null,null,null,null,null,null,null,null,null,null,null,null,null,null,null,null,null,"",16,"Résoudre des problèmes en utilisant des nombres entiers et le calcul.",3,"","","","","","","","","","","","","","","","","","","","","","","","","","","","","","","","","","","","","","","","","","","","","","","","","","","","","","","","","","","","","","","","","","","","","","","","","","","","","","","","","","","","","","","","","","","","","","","","","","","","","","","","","","","","","","","","","","","","","","","","","","","","","","","","","","","","","","","","","","","","","","","","","","","","","","","","","","","","","","","","","","","","","","","","","","","","","","","","","","","","","","","","","","","","","","","","","","","","","","","","","",16,"Résoudre des problèmes en utilisant des nombres entiers et le calcul.",3,"","","","","","","","","","","","","","","","","","","","","","","","","","","","","","","","","","","","","","","","","","","","","","","","","","","","","","","","","","","","","","","","","","","","","","","","","","","","","","","","","","","","","","","","","","","","","","","","","","","","","","","","","","","","","","","","","","","","","","","","","","","","","","","","","","","","","","","","","","","","","","","","","","","","","","","","","","","","","","","","","","","","","","","","","","","","","","","","","","","","","","","","","","","","","","","","","","","","","","","","","",16,"Résoudre des problèmes en utilisant des nombres entiers et le calcul.",3,"","","","","","","","","","","","","","","","","","","","","","","","","","","","","","","","","","","","","","","","","","","","","","","","","","","","","","","","","","","","","","","","","","","","","","","","","","","","","","","","","","","","","","","","","","","","","","","","","","","","","","","","","","","","","","","","","","","","","","","","","","","","","","","","","","","","","","","","","","","","","","","","","","","","","","","","","","","","","","","","","","","","","","","","","","","","","","","","","","","","","","","","","","","","","","","","","","","","","","","","",null,null,null,null,null,null,null,null,null,null,null,null,null,null,null,null,null,null,null,null,null,null,null,null,null,null,null,null,null,null,null,null,null,null,null,{"$f":"IF(OR(ISBLANK(INDEX(liste_des_resultats,ROW()-1,CELL(\"contenu\",'Bilan - élève'!$J$1))),ISERROR(INDEX(liste_des_resultats,ROW()-1,CELL(\"contenu\",'Bilan - élève'!$J$1)))),\"\",INDEX(liste_des_resultats,ROW()-1,CELL(\"contenu\",'Bilan - élève'!$J$1)))","v":""},3,"","","","","","","","","","","","","","","","","","","","","","","","","","","","","","","","","","","",1,2,8,9,0,null,null,null,null,null,null,null,"","","","","","","","","","","","","","","","","","","","","","","","","","","","","","","","","","","","","","","","","","","","","","","","","","","","","","","","","","","","","","",3,"","","","","","","","","","","","","","","","","","","","","","","","","","","","","","","","","","","","","","","","","","","","","","","","","","","","","","","","","","","","","","","","","","","","","","","","","","","","","","","","","","","","","","","","","","","","","","","","","","","","","","","","","","","","","","","","","","","","","","","","","","","","","","","","","","","","","","","","","",null,"",{"$f":"IF(ZN7=\"A\",0,ZN7)","v":""},{"$f":"IF(ZO7=\"A\",0,ZO7)","v":""},{"$f":"IF(ZP7=\"A\",0,ZP7)","v":""},{"$f":"IF(ZQ7=\"A\",0,ZQ7)","v":""},{"$f":"IF(ZR7=\"A\",0,ZR7)","v":""},{"$f":"IF(ZS7=\"A\",0,ZS7)","v":""},{"$f":"IF(ZT7=\"A\",0,ZT7)","v":""},{"$f":"IF(ZU7=\"A\",0,ZU7)","v":""},{"$f":"IF(ZV7=\"A\",0,ZV7)","v":""},{"$f":"IF(ZW7=\"A\",0,ZW7)","v":""},{"$f":"IF(ZX7=\"A\",0,ZX7)","v":""},{"$f":"IF(ZY7=\"A\",0,ZY7)","v":""},{"$f":"IF(ZZ7=\"A\",0,ZZ7)","v":""},{"$f":"IF(AAA7=\"A\",0,AAA7)","v":""},{"$f":"IF(AAB7=\"A\",0,AAB7)","v":""},{"$f":"IF(AAC7=\"A\",0,AAC7)","v":""},{"$f":"IF(AAD7=\"A\",0,AAD7)","v":""},{"$f":"IF(AAE7=\"A\",0,AAE7)","v":""},{"$f":"IF(AAF7=\"A\",0,AAF7)","v":""},{"$f":"IF(AAG7=\"A\",0,AAG7)","v":""},{"$f":"IF(AAH7=\"A\",0,AAH7)","v":""},{"$f":"IF(AAI7=\"A\",0,AAI7)","v":""},{"$f":"IF(AAJ7=\"A\",0,AAJ7)","v":""},{"$f":"IF(AAK7=\"A\",0,AAK7)","v":""},{"$f":"IF(AAL7=\"A\",0,AAL7)","v":""},{"$f":"IF(AAM7=\"A\",0,AAM7)","v":""},{"$f":"IF(AAN7=\"A\",0,AAN7)","v":""},{"$f":"IF(AAO7=\"A\",0,AAO7)","v":""},{"$f":"IF(AAP7=\"A\",0,AAP7)","v":""},{"$f":"IF(AAQ7=\"A\",0,AAQ7)","v":""},{"$f":"IF(AAR7=\"A\",0,AAR7)","v":""},{"$f":"IF(AAS7=\"A\",0,AAS7)","v":""},{"$f":"IF(AAT7=\"A\",0,AAT7)","v":""},{"$f":"IF(AAU7=\"A\",0,AAU7)","v":""}]
[null,16,7,null,null,null,null,null,null,null,null,null,null,null,null,null,null,null,null,null,null,null,null,null,null,null,null,null,null,null,null,null,null,null,null,null,null,null,null,"",16,"Résoudre des problèmes en utilisant des nombres entiers et le calcul.",2,"","","","","","","","","","","","","","","","","","","","","","","","","","","","","","","","","","","","","","","","","","","","","","","","","","","","","","","","","","","","","","","","","","","","","","","","","","","","","","","","","","","","","","","","","","","","","","","","","","","","","","","","","","","","","","","","","","","","","","","","","","","","","","","","","","","","","","","","","","","","","","","","","","","","","","","","","","","","","","","","","","","","","","","","","","","","","","","","","","","","","","","","","","","","","","","","","","","","","","","","","",16,"Résoudre des problèmes en utilisant des nombres entiers et le calcul.",2,"","","","","","","","","","","","","","","","","","","","","","","","","","","","","","","","","","","","","","","","","","","","","","","","","","","","","","","","","","","","","","","","","","","","","","","","","","","","","","","","","","","","","","","","","","","","","","","","","","","","","","","","","","","","","","","","","","","","","","","","","","","","","","","","","","","","","","","","","","","","","","","","","","","","","","","","","","","","","","","","","","","","","","","","","","","","","","","","","","","","","","","","","","","","","","","","","","","","","","","","","",16,"Résoudre des problèmes en utilisant des nombres entiers et le calcul.",2,"","","","","","","","","","","","","","","","","","","","","","","","","","","","","","","","","","","","","","","","","","","","","","","","","","","","","","","","","","","","","","","","","","","","","","","","","","","","","","","","","","","","","","","","","","","","","","","","","","","","","","","","","","","","","","","","","","","","","","","","","","","","","","","","","","","","","","","","","","","","","","","","","","","","","","","","","","","","","","","","","","","","","","","","","","","","","","","","","","","","","","","","","","","","","","","","","","","","","","","","",null,null,null,null,null,null,null,null,null,null,null,null,null,null,null,null,null,null,null,null,null,null,null,null,null,null,null,null,null,null,null,null,null,null,null,{"$f":"IF(OR(ISBLANK(INDEX(liste_des_resultats,ROW()-1,CELL(\"contenu\",'Bilan - élève'!$J$1))),ISERROR(INDEX(liste_des_resultats,ROW()-1,CELL(\"contenu\",'Bilan - élève'!$J$1)))),\"\",INDEX(liste_des_resultats,ROW()-1,CELL(\"contenu\",'Bilan - élève'!$J$1)))","v":""},3,"","","","","","","","","","","","","","","","","","","","","","","","","","","","","","","","","","","",1,9,0,null,null,null,null,null,null,null,null,null,"","","","","","","","","","","","","","","","","","","","","","","","","","","","","","","","","","","","","","","","","","","","","","","","","","","","","","","","","","","","","",3,"","","","","","","","","","","","","","","","","","","","","","","","","","","","","","","","","","","","","","","","","","","","","","","","","","","","","","","","","","","","","","","","","","","","","","","","","","","","","","","","","","","","","","","","","","","","","","","","","","","","","","","","","","","","","","","","","","","","","","","","","","","","","","","","","","","","","","","","","","",null,"","","","","","","","","","","","","","","","","","","","","","","","","","","","","","","","","","",""]
[null,16,8,null,null,null,null,null,null,null,null,null,null,null,null,null,null,null,null,null,null,null,null,null,null,null,null,null,null,null,null,null,null,null,null,null,null,null,null,"",16,"Résoudre des problèmes en utilisant des nombres entiers et le calcul.",2,"","","","","","","","","","","","","","","","","","","","","","","","","","","","","","","","","","","","","","","","","","","","","","","","","","","","","","","","","","","","","","","","","","","","","","","","","","","","","","","","","","","","","","","","","","","","","","","","","","","","","","","","","","","","","","","","","","","","","","","","","","","","","","","","","","","","","","","","","","","","","","","","","","","","","","","","","","","","","","","","","","","","","","","","","","","","","","","","","","","","","","","","","","","","","","","","","","","","","","","","","",16,"Résoudre des problèmes en utilisant des nombres entiers et le calcul.",2,"","","","","","","","","","","","","","","","","","","","","","","","","","","","","","","","","","","","","","","","","","","","","","","","","","","","","","","","","","","","","","","","","","","","","","","","","","","","","","","","","","","","","","","","","","","","","","","","","","","","","","","","","","","","","","","","","","","","","","","","","","","","","","","","","","","","","","","","","","","","","","","","","","","","","","","","","","","","","","","","","","","","","","","","","","","","","","","","","","","","","","","","","","","","","","","","","","","","","","","","","",16,"Résoudre des problèmes en utilisant des nombres entiers et le calcul.",2,"","","","","","","","","","","","","","","","","","","","","","","","","","","","","","","","","","","","","","","","","","","","","","","","","","","","","","","","","","","","","","","","","","","","","","","","","","","","","","","","","","","","","","","","","","","","","","","","","","","","","","","","","","","","","","","","","","","","","","","","","","","","","","","","","","","","","","","","","","","","","","","","","","","","","","","","","","","","","","","","","","","","","","","","","","","","","","","","","","","","","","","","","","","","","","","","","","","","","","","","",null,null,null,null,null,null,null,null,null,null,null,null,null,null,null,null,null,null,null,null,null,null,null,null,null,null,null,null,null,null,null,null,null,null,null,{"$f":"IF(OR(ISBLANK(INDEX(liste_des_resultats,ROW()-1,CELL(\"contenu\",'Bilan - élève'!$J$1))),ISERROR(INDEX(liste_des_resultats,ROW()-1,CELL(\"contenu\",'Bilan - élève'!$J$1)))),\"\",INDEX(liste_des_resultats,ROW()-1,CELL(\"contenu\",'Bilan - élève'!$J$1)))","v":""},3,"",{"$f":"IF(F9=1,3,IF(F9=2,2,IF(F9=8,1,IF(F9=9,0,IF(ISBLANK(F9),\"\",IF(F9=0,\"A\"))))))","v":""},{"$f":"IF(G9=1,3,IF(G9=2,2,IF(G9=8,1,IF(G9=9,0,IF(ISBLANK(G9),\"\",IF(G9=0,\"A\"))))))","v":""},{"$f":"IF(H9=1,3,IF(H9=2,2,IF(H9=8,1,IF(H9=9,0,IF(ISBLANK(H9),\"\",IF(H9=0,\"A\"))))))","v":""},{"$f":"IF(I9=1,3,IF(I9=2,2,IF(I9=8,1,IF(I9=9,0,IF(ISBLANK(I9),\"\",IF(I9=0,\"A\"))))))","v":""},{"$f":"IF(J9=1,3,IF(J9=2,2,IF(J9=8,1,IF(J9=9,0,IF(ISBLANK(J9),\"\",IF(J9=0,\"A\"))))))","v":""},{"$f":"IF(K9=1,3,IF(K9=2,2,IF(K9=8,1,IF(K9=9,0,IF(ISBLANK(K9),\"\",IF(K9=0,\"A\"))))))","v":""},{"$f":"IF(L9=1,3,IF(L9=2,2,IF(L9=8,1,IF(L9=9,0,IF(ISBLANK(L9),\"\",IF(L9=0,\"A\"))))))","v":""},{"$f":"IF(M9=1,3,IF(M9=2,2,IF(M9=8,1,IF(M9=9,0,IF(ISBLANK(M9),\"\",IF(M9=0,\"A\"))))))","v":""},{"$f":"IF(N9=1,3,IF(N9=2,2,IF(N9=8,1,IF(N9=9,0,IF(ISBLANK(N9),\"\",IF(N9=0,\"A\"))))))","v":""},{"$f":"IF(O9=1,3,IF(O9=2,2,IF(O9=8,1,IF(O9=9,0,IF(ISBLANK(O9),\"\",IF(O9=0,\"A\"))))))","v":""},{"$f":"IF(P9=1,3,IF(P9=2,2,IF(P9=8,1,IF(P9=9,0,IF(ISBLANK(P9),\"\",IF(P9=0,\"A\"))))))","v":""},{"$f":"IF(Q9=1,3,IF(Q9=2,2,IF(Q9=8,1,IF(Q9=9,0,IF(ISBLANK(Q9),\"\",IF(Q9=0,\"A\"))))))","v":""},{"$f":"IF(R9=1,3,IF(R9=2,2,IF(R9=8,1,IF(R9=9,0,IF(ISBLANK(R9),\"\",IF(R9=0,\"A\"))))))","v":""},{"$f":"IF(S9=1,3,IF(S9=2,2,IF(S9=8,1,IF(S9=9,0,IF(ISBLANK(S9),\"\",IF(S9=0,\"A\"))))))","v":""},{"$f":"IF(T9=1,3,IF(T9=2,2,IF(T9=8,1,IF(T9=9,0,IF(ISBLANK(T9),\"\",IF(T9=0,\"A\"))))))","v":""},{"$f":"IF(U9=1,3,IF(U9=2,2,IF(U9=8,1,IF(U9=9,0,IF(ISBLANK(U9),\"\",IF(U9=0,\"A\"))))))","v":""},{"$f":"IF(V9=1,3,IF(V9=2,2,IF(V9=8,1,IF(V9=9,0,IF(ISBLANK(V9),\"\",IF(V9=0,\"A\"))))))","v":""},{"$f":"IF(W9=1,3,IF(W9=2,2,IF(W9=8,1,IF(W9=9,0,IF(ISBLANK(W9),\"\",IF(W9=0,\"A\"))))))","v":""},{"$f":"IF(X9=1,3,IF(X9=2,2,IF(X9=8,1,IF(X9=9,0,IF(ISBLANK(X9),\"\",IF(X9=0,\"A\"))))))","v":""},{"$f":"IF(Y9=1,3,IF(Y9=2,2,IF(Y9=8,1,IF(Y9=9,0,IF(ISBLANK(Y9),\"\",IF(Y9=0,\"A\"))))))","v":""},{"$f":"IF(Z9=1,3,IF(Z9=2,2,IF(Z9=8,1,IF(Z9=9,0,IF(ISBLANK(Z9),\"\",IF(Z9=0,\"A\"))))))","v":""},{"$f":"IF(AA9=1,3,IF(AA9=2,2,IF(AA9=8,1,IF(AA9=9,0,IF(ISBLANK(AA9),\"\",IF(AA9=0,\"A\"))))))","v":""},{"$f":"IF(AB9=1,3,IF(AB9=2,2,IF(AB9=8,1,IF(AB9=9,0,IF(ISBLANK(AB9),\"\",IF(AB9=0,\"A\"))))))","v":""},{"$f":"IF(AC9=1,3,IF(AC9=2,2,IF(AC9=8,1,IF(AC9=9,0,IF(ISBLANK(AC9),\"\",IF(AC9=0,\"A\"))))))","v":""},{"$f":"IF(AD9=1,3,IF(AD9=2,2,IF(AD9=8,1,IF(AD9=9,0,IF(ISBLANK(AD9),\"\",IF(AD9=0,\"A\"))))))","v":""},{"$f":"IF(AE9=1,3,IF(AE9=2,2,IF(AE9=8,1,IF(AE9=9,0,IF(ISBLANK(AE9),\"\",IF(AE9=0,\"A\"))))))","v":""},{"$f":"IF(AF9=1,3,IF(AF9=2,2,IF(AF9=8,1,IF(AF9=9,0,IF(ISBLANK(AF9),\"\",IF(AF9=0,\"A\"))))))","v":""},{"$f":"IF(AG9=1,3,IF(AG9=2,2,IF(AG9=8,1,IF(AG9=9,0,IF(ISBLANK(AG9),\"\",IF(AG9=0,\"A\"))))))","v":""},{"$f":"IF(AH9=1,3,IF(AH9=2,2,IF(AH9=8,1,IF(AH9=9,0,IF(ISBLANK(AH9),\"\",IF(AH9=0,\"A\"))))))","v":""},{"$f":"IF(AI9=1,3,IF(AI9=2,2,IF(AI9=8,1,IF(AI9=9,0,IF(ISBLANK(AI9),\"\",IF(AI9=0,\"A\"))))))","v":""},{"$f":"IF(AJ9=1,3,IF(AJ9=2,2,IF(AJ9=8,1,IF(AJ9=9,0,IF(ISBLANK(AJ9),\"\",IF(AJ9=0,\"A\"))))))","v":""},{"$f":"IF(AK9=1,3,IF(AK9=2,2,IF(AK9=8,1,IF(AK9=9,0,IF(ISBLANK(AK9),\"\",IF(AK9=0,\"A\"))))))","v":""},{"$f":"IF(AL9=1,3,IF(AL9=2,2,IF(AL9=8,1,IF(AL9=9,0,IF(ISBLANK(AL9),\"\",IF(AL9=0,\"A\"))))))","v":""},{"$f":"IF(AM9=1,3,IF(AM9=2,2,IF(AM9=8,1,IF(AM9=9,0,IF(ISBLANK(AM9),\"\",IF(AM9=0,\"A\"))))))","v":""},1,2,8,9,0,null,null,null,null,null,null,null,"","","","","","","","","","","","","","","","","","","","","","","","","","","","","","","","","","","","","","","","","","","","","","","","","","","","","","","","","","","","","",3,"","","","","","","","","","","","","","","","","","","","","","","","","","","","","","","","","","","","","","","","","","","","","","","","","","","","","","","","","","","","","","","","","","","","","","","","","","","","","","","","","","","","","","","","","","","","","","","","","","","","","","","","","","","","","","","","","","","","","","","","","","","","","","","","","","","","","","","","","","",null,"","","","","","","","","","","","","","","","","","","","","","","","","","","","","","","","","","",""]
[3,20,9,null,null,null,null,null,null,null,null,null,null,null,null,null,null,null,null,null,null,null,null,null,null,null,null,null,null,null,null,null,null,null,null,null,null,null,null,"",20,"Résoudre des problèmes impliquant des longueurs, des masses, des contenances, des durées…",1,"","","","","","","","","","","","","","","","","","","","","","","","","","","","","","","","","","","","","","","","","","","","","","","","","","","","","","","","","","","","","","","","","","","","","","","","","","","","","","","","","","","","","","","","","","","","","","","","","","","","","","","","","","","","","","","","","","","","","","","","","","","","","","","","","","","","","","","","","","","","","","","","","","","","","","","","","","","","","","","","","","","","","","","","","","","","","","","","","","","","","","","","","","","","","","","","","","","","","","","","","",20,"Résoudre des problèmes impliquant des longueurs, des masses, des contenances, des durées…",1,"","","","","","","","","","","","","","","","","","","","","","","","","","","","","","","","","","","","","","","","","","","","","","","","","","","","","","","","","","","","","","","","","","","","","","","","","","","","","","","","","","","","","","","","","","","","","","","","","","","","","","","","","","","","","","","","","","","","","","","","","","","","","","","","","","","","","","","","","","","","","","","","","","","","","","","","","","","","","","","","","","","","","","","","","","","","","","","","","","","","","","","","","","","","","","","","","","","","","","","","","",20,"Résoudre des problèmes impliquant des longueurs, des masses, des contenances, des durées…",1,"","","","","","","","","","","","","","","","","","","","","","","","","","","","","","","","","","","","","","","","","","","","","","","","","","","","","","","","","","","","","","","","","","","","","","","","","","","","","","","","","","","","","","","","","","","","","","","","","","","","","","","","","","","","","","","","","","","","","","","","","","","","","","","","","","","","","","","","","","","","","","","","","","","","","","","","","","","","","","","","","","","","","","","","","","","","","","","","","","","","","","","","","","","","","","","","","","","","","","","","",null,null,null,null,null,null,null,null,null,null,null,null,null,null,null,null,null,null,null,null,null,null,null,null,null,null,null,null,null,null,null,null,null,null,null,{"$f":"IF(OR(ISBLANK(INDEX(liste_des_resultats,ROW()-1,CELL(\"contenu\",'Bilan - élève'!$J$1))),ISERROR(INDEX(liste_des_resultats,ROW()-1,CELL(\"contenu\",'Bilan - élève'!$J$1)))),\"\",INDEX(liste_des_resultats,ROW()-1,CELL(\"contenu\",'Bilan - élève'!$J$1)))","v":""},3,"","","","","","","","","","","","","","","","","","","","","","","","","","","","","","","","","","","",1,9,0,null,null,null,null,null,null,null,null,null,"","","","","","","","","","","","","","","","","","","","","","","","","","","","","","","","","","","","","","","","","","","","","","","","","","","","","","","","","","","","","","","","","","","","","","","","","","","","",3,"","","","","","","","","","","","","","","","","","","","","","","","","","","","","","","","","","","","","","","","","","","","","","","","","","","","","","","","","","","","","","","","","","","","","","","","","","","","","","","","","","","","","","","","","","","","","","","","","","","","","","","","","","","","","","","","","","","","","","","","","","","",null,"","","","","","","","","","","","","","","","","","","","","","","","","","","","","","","","","","",""]
[null,20,10,null,null,null,null,null,null,null,null,null,null,null,null,null,null,null,null,null,null,null,null,null,null,null,null,null,null,null,null,null,null,null,null,null,null,null,null,"",20,"Résoudre des problèmes impliquant des longueurs, des masses, des contenances, des durées…",1,"","","","","","","","","","","","","","","","","","","","","","","","","","","","","","","","","","","","","","","","","","","","","","","","","","","","","","","","","","","","","","","","","","","","","","","","","","","","","","","","","","","","","","","","","","","","","","","","","","","","","","","","","","","","","","","","","","","","","","","","","","","","","","","","","","","","","","","","","","","","","","","","","","","","","","","","","","","","","","","","","","","","","","","","","","","","","","","","","","","","","","","","","","","","","","","","","","","","","","","","","",20,"Résoudre des problèmes impliquant des longueurs, des masses, des contenances, des durées…",1,"","","","","","","","","","","","","","","","","","","","","","","","","","","","","","","","","","","","","","","","","","","","","","","","","","","","","","","","","","","","","","","","","","","","","","","","","","","","","","","","","","","","","","","","","","","","","","","","","","","","","","","","","","","","","","","","","","","","","","","","","","","","","","","","","","","","","","","","","","","","","","","","","","","","","","","","","","","","","","","","","","","","","","","","","","","","","","","","","","","","","","","","","","","","","","","","","","","","","","","","","",20,"Résoudre des problèmes impliquant des longueurs, des masses, des contenances, des durées…",1,"","","","","","","","","","","","","","","","","","","","","","","","","","","","","","","","","","","","","","","","","","","","","","","","","","","","","","","","","","","","","","","","","","","","","","","","","","","","","","","","","","","","","","","","","","","","","","","","","","","","","","","","","","","","","","","","","","","","","","","","","","","","","","","","","","","","","","","","","","","","","","","","","","","","","","","","","","","","","","","","","","","","","","","","","","","","","","","","","","","","","","","","","","","","","","","","","","","","","","","","",null,null,null,null,null,null,null,null,null,null,null,null,null,null,null,null,null,null,null,null,null,null,null,null,null,null,null,null,null,null,null,null,null,null,null,{"$f":"IF(OR(ISBLANK(INDEX(liste_des_resultats,ROW()-1,CELL(\"contenu\",'Bilan - élève'!$J$1))),ISERROR(INDEX(liste_des_resultats,ROW()-1,CELL(\"contenu\",'Bilan - élève'!$J$1)))),\"\",INDEX(liste_des_resultats,ROW()-1,CELL(\"contenu\",'Bilan - élève'!$J$1)))","v":""},3,"","","","","","","","","","","","","","","","","","","","","","","","","","","","","","","","","","","",1,8,9,0,null,null,null,null,null,null,null,null,"","","","","","","","","","","","","","","","","","","","","","","","","","","","","","","","","","","","","","","","","","","","","","","","","","","","","","","","","","","","","","","","","","","","","","","","","","","","",3,"","","","","","","","","","","","","","","","","","","","","","","","","","","","","","","","","","","","","","","","","","","","","","","","","","","","","","","","","","","","","","","","","","","","","","","","","","","","","","","","","","","","","","","","","","","","","","","","","","","","","","","","","","","","","","","","","","","","","","","","","","","",null,"","","","","","","","","","","","","","","","","","","","","","","","","","","","","","","","","","",""]
[4,23,11,null,null,null,null,null,null,null,null,null,null,null,null,null,null,null,null,null,null,null,null,null,null,null,null,null,null,null,null,null,null,null,null,null,null,null,null,"",23,"Reconnaitre, nommer, décrire, reproduire, construire quelques figures géométriques.",2,{"$f":"IF(AND(AR$1=$AO12,AR$32=$AQ12),$AN12,\"\")","v":""},"","","","","","","","","",{"$f":"IF(AND(BB$1=$AO12,BB$32=$AQ12),$AN12,\"\")","v":""},"","","","","","","","","",{"$f":"IF(AND(BL$1=$AO12,BL$32=$AQ12),$AN12,\"\")","v":""},"","","","","","","","","",{"$f":"IF(AND(BV$1=$AO12,BV$32=$AQ12),$AN12,\"\")","v":""},"","","","","","","","","",{"$f":"IF(AND(CF$1=$AO12,CF$32=$AQ12),$AN12,\"\")","v":""},"","","","","","","","","",{"$f":"IF(AND(CP$1=$AO12,CP$32=$AQ12),$AN12,\"\")","v":""},"","","","","","","","","",{"$f":"IF(AND(CZ$1=$AO12,CZ$32=$AQ12),$AN12,\"\")","v":""},"","","","","","","","","",{"$f":"IF(AND(DJ$1=$AO12,DJ$32=$AQ12),$AN12,\"\")","v":""},"","","","","","","","","",{"$f":"IF(AND(DT$1=$AO12,DT$32=$AQ12),$AN12,\"\")","v":""},"","","","","","","","","",{"$f":"IF(AND(ED$1=$AO12,ED$32=$AQ12),$AN12,\"\")","v":""},"","","","","","","","","",{"$f":"IF(AND(EN$1=$AO12,EN$32=$AQ12),$AN12,\"\")","v":""},"","","","","","","","","",{"$f":"IF(AND(EX$1=$AO12,EX$32=$AQ12),$AN12,\"\")","v":""},"","","","","","","","","",{"$f":"IF(AND(FH$1=$AO12,FH$32=$AQ12),$AN12,\"\")","v":""},"","","","","","","","","",{"$f":"IF(AND(FR$1=$AO12,FR$32=$AQ12),$AN12,\"\")","v":""},"","","","","","","","","",{"$f":"IF(AND(GB$1=$AO12,GB$32=$AQ12),$AN12,\"\")","v":""},"","","","","","","","","",{"$f":"IF(AND(GL$1=$AO12,GL$32=$AQ12),$AN12,\"\")","v":""},"","","","","","","","","",{"$f":"IF(AND(GV$1=$AO12,GV$32=$AQ12),$AN12,\"\")","v":""},"","","","","","","","","",{"$f":"IF(AND(HF$1=$AO12,HF$32=$AQ12),$AN12,\"\")","v":""},"","","","","","","","","",{"$f":"IF(AND(HP$1=$AO12,HP$32=$AQ12),$AN12,\"\")","v":""},"","","","","","","","","",{"$f":"IF(AND(HZ$1=$AO12,HZ$32=$AQ12),$AN12,\"\")","v":""},"","","","","","","","","","",23,"Reconnaitre, nommer, décrire, reproduire, construire quelques figures géométriques.",2,{"$f":"IF(AND(IN$1=$AO12,IN$32=$AQ12,ISNUMBER($IJ12)),$IJ12*$ZL12,\"\")","v":""},"","","","","","","","","",{"$f":"IF(AND(IX$1=$AO12,IX$32=$AQ12,ISNUMBER($IJ12)),$IJ12*$ZL12,\"\")","v":""},"","","","","","","","","",{"$f":"IF(AND(JH$1=$AO12,JH$32=$AQ12,ISNUMBER($IJ12)),$IJ12*$ZL12,\"\")","v":""},"","","","","","","","","",{"$f":"IF(AND(JR$1=$AO12,JR$32=$AQ12,ISNUMBER($IJ12)),$IJ12*$ZL12,\"\")","v":""},"","","","","","","","","",{"$f":"IF(AND(KB$1=$AO12,KB$32=$AQ12,ISNUMBER($IJ12)),$IJ12*$ZL12,\"\")","v":""},"","","","","","","","","",{"$f":"IF(AND(KL$1=$AO12,KL$32=$AQ12,ISNUMBER($IJ12)),$IJ12*$ZL12,\"\")","v":""},"","","","","","","","","",{"$f":"IF(AND(KV$1=$AO12,KV$32=$AQ12,ISNUMBER($IJ12)),$IJ12*$ZL12,\"\")","v":""},"","","","","","","","","",{"$f":"IF(AND(LF$1=$AO12,LF$32=$AQ12,ISNUMBER($IJ12)),$IJ12*$ZL12,\"\")","v":""},"","","","","","","","","",{"$f":"IF(AND(LP$1=$AO12,LP$32=$AQ12,ISNUMBER($IJ12)),$IJ12*$ZL12,\"\")","v":""},"","","","","","","","","",{"$f":"IF(AND(LZ$1=$AO12,LZ$32=$AQ12,ISNUMBER($IJ12)),$IJ12*$ZL12,\"\")","v":""},"","","","","","","","","",{"$f":"IF(AND(MJ$1=$AO12,MJ$32=$AQ12,ISNUMBER($IJ12)),$IJ12*$ZL12,\"\")","v":""},"","","","","","","","","",{"$f":"IF(AND(MT$1=$AO12,MT$32=$AQ12,ISNUMBER($IJ12)),$IJ12*$ZL12,\"\")","v":""},"","","","","","","","","",{"$f":"IF(AND(ND$1=$AO12,ND$32=$AQ12,ISNUMBER($IJ12)),$IJ12*$ZL12,\"\")","v":""},"","","","","","","","","",{"$f":"IF(AND(NN$1=$AO12,NN$32=$AQ12,ISNUMBER($IJ12)),$IJ12*$ZL12,\"\")","v":""},"","","","","","","","","",{"$f":"IF(AND(NX$1=$AO12,NX$32=$AQ12,ISNUMBER($IJ12)),$IJ12*$ZL12,\"\")","v":""},"","","","","","","","","",{"$f":"IF(AND(OH$1=$AO12,OH$32=$AQ12,ISNUMBER($IJ12)),$IJ12*$ZL12,\"\")","v":""},"","","","","","","","","",{"$f":"IF(AND(OR$1=$AO12,OR$32=$AQ12,ISNUMBER($IJ12)),$IJ12*$ZL12,\"\")","v":""},"","","","","","","","","",{"$f":"IF(AND(PB$1=$AO12,PB$32=$AQ12,ISNUMBER($IJ12)),$IJ12*$ZL12,\"\")","v":""},"","","","","","","","","",{"$f":"IF(AND(PL$1=$AO12,PL$32=$AQ12,ISNUMBER($IJ12)),$IJ12*$ZL12,\"\")","v":""},"","","","","","","","","",{"$f":"IF(AND(PV$1=$AO12,PV$32=$AQ12,ISNUMBER($IJ12)),$IJ12*$ZL12,\"\")","v":""},"","","","","","","","","","",23,"Reconnaitre, nommer, décrire, reproduire, construire quelques figures géométriques.",2,{"$f":"IF(AND(QJ$1=$AO12,QJ$32=$AQ12),$QF12,\"\")","v":""},"","","","","","","","","",{"$f":"IF(AND(QT$1=$AO12,QT$32=$AQ12),$QF12,\"\")","v":""},"","","","","","","","","",{"$f":"IF(AND(RD$1=$AO12,RD$32=$AQ12),$QF12,\"\")","v":""},"","","","","","","","","",{"$f":"IF(AND(RN$1=$AO12,RN$32=$AQ12),$QF12,\"\")","v":""},"","","","","","","","","",{"$f":"IF(AND(RX$1=$AO12,RX$32=$AQ12),$QF12,\"\")","v":""},"","","","","","","","","",{"$f":"IF(AND(SH$1=$AO12,SH$32=$AQ12),$QF12,\"\")","v":""},"","","","","","","","","",{"$f":"IF(AND(SR$1=$AO12,SR$32=$AQ12),$QF12,\"\")","v":""},"","","","","","","","","",{"$f":"IF(AND(TB$1=$AO12,TB$32=$AQ12),$QF12,\"\")","v":""},"","","","","","","","","",{"$f":"IF(AND(TL$1=$AO12,TL$32=$AQ12),$QF12,\"\")","v":""},"","","","","","","","","",{"$f":"IF(AND(TV$1=$AO12,TV$32=$AQ12),$QF12,\"\")","v":""},"","","","","","","","","",{"$f":"IF(AND(UF$1=$AO12,UF$32=$AQ12),$QF12,\"\")","v":""},"","","","","","","","","",{"$f":"IF(AND(UP$1=$AO12,UP$32=$AQ12),$QF12,\"\")","v":""},"","","","","","","","","",{"$f":"IF(AND(UZ$1=$AO12,UZ$32=$AQ12),$QF12,\"\")","v":""},"","","","","","","","","",{"$f":"IF(AND(VJ$1=$AO12,VJ$32=$AQ12),$QF12,\"\")","v":""},"","","","","","","","","",{"$f":"IF(AND(VT$1=$AO12,VT$32=$AQ12),$QF12,\"\")","v":""},"","","","","","","","","",{"$f":"IF(AND(WD$1=$AO12,WD$32=$AQ12),$QF12,\"\")","v":""},"","","","","","","","","",{"$f":"IF(AND(WN$1=$AO12,WN$32=$AQ12),$QF12,\"\")","v":""},"","","","","","","","","",{"$f":"IF(AND(WX$1=$AO12,WX$32=$AQ12),$QF12,\"\")","v":""},"","","","","","","","","",{"$f":"IF(AND(XH$1=$AO12,XH$32=$AQ12),$QF12,\"\")","v":""},"","","","","","","","","",{"$f":"IF(AND(XR$1=$AO12,XR$32=$AQ12),$QF12,\"\")","v":""},"","","","","","","","","",null,null,null,null,null,null,null,null,null,null,null,null,null,null,null,null,null,null,null,null,null,null,null,null,null,null,null,null,null,null,null,null,null,null,null,{"$f":"IF(OR(ISBLANK(INDEX(liste_des_resultats,ROW()-1,CELL(\"contenu\",'Bilan - élève'!$J$1))),ISERROR(INDEX(liste_des_resultats,ROW()-1,CELL(\"contenu\",'Bilan - élève'!$J$1)))),\"\",INDEX(liste_des_resultats,ROW()-1,CELL(\"contenu\",'Bilan - élève'!$J$1)))","v":""},3,"","","","","","","","","","","","","","","","","","","","","","","","","","","","","","","","","","","",1,9,0,null,null,null,null,null,null,null,null,null,"","","","","","","","","","","","","","","","","","","","","","","","","","","","","","","","","","","","","","","","","","","","","","","","","","","","","","","","","","","","","","","","","","","","","","","","","","","","","","","","","","","","","","","","","",3,"","","","","","","","","","","","","","","","","","","","","","","","","","","","","","","","","","","","","","","","","","","","","","","","","","","","","","","","","","","","","","","","","","","","","","","","","","","","","","","","","","","","","","","","","","","","","","","","","","","","","","","","","","","","","","",null,"","","","","","","","","","","","","","","","","","","","","","","","","","","","","","","","","","",""]
[null,21,12,null,null,null,null,null,null,null,null,null,null,null,null,null,null,null,null,null,null,null,null,null,null,null,null,null,null,null,null,null,null,null,null,null,null,null,null,"",21,"(Se) repérer et (se) déplacer en utilisant des repères et des représentations.",1,"","","","","","","","","","","","","","","","","","","","","","","","","","","","","","","","","","","","","","","","","","","","","","","","","","","","","","","","","","","","","","","","","","","","","","","","","","","","","","","","","","","","","","","","","","","","","","","","","","","","","","","","","","","","","","","","","","","","","","","","","","","","","","","","","","","","","","","","","","","","","","","","","","","","","","","","","","","","","","","","","","","","","","","","","","","","","","","","","","","","","","","","","","","","","","","","","","","","","","","","","",21,"(Se) repérer et (se) déplacer en utilisant des repères et des représentations.",1,"","","","","","","","","","","","","","","","","","","","","","","","","","","","","","","","","","","","","","","","","","","","","","","","","","","","","","","","","","","","","","","","","","","","","","","","","","","","","","","","","","","","","","","","","","","","","","","","","","","","","","","","","","","","","","","","","","","","","","","","","","","","","","","","","","","","","","","","","","","","","","","","","","","","","","","","","","","","","","","","","","","","","","","","","","","","","","","","","","","","","","","","","","","","","","","","","","","","","","","","","",21,"(Se) repérer et (se) déplacer en utilisant des repères et des représentations.",1,"","","","","","","","","","","","","","","","","","","","","","","","","","","","","","","","","","","","","","","","","","","","","","","","","","","","","","","","","","","","","","","","","","","","","","","","","","","","","","","","","","","","","","","","","","","","","","","","","","","","","","","","","","","","","","","","","","","","","","","","","","","","","","","","","","","","","","","","","","","","","","","","","","","","","","","","","","","","","","","","","","","","","","","","","","","","","","","","","","","","","","","","","","","","","","","","","","","","","","","","",null,null,null,null,null,null,null,null,null,null,null,null,null,null,null,null,null,null,null,null,null,null,null,null,null,null,null,null,null,null,null,null,null,null,null,{"$f":"IF(OR(ISBLANK(INDEX(liste_des_resultats,ROW()-1,CELL(\"contenu\",'Bilan - élève'!$J$1))),ISERROR(INDEX(liste_des_resultats,ROW()-1,CELL(\"contenu\",'Bilan - élève'!$J$1)))),\"\",INDEX(liste_des_resultats,ROW()-1,CELL(\"contenu\",'Bilan - élève'!$J$1)))","v":""},3,"","","","","","","","","","","","","","","","","","","","","","","","","","","","","","","","","","","",1,9,0,null,null,null,null,null,null,null,null,null,"","","","","","","","","","","","","","","","","","","","","","","","","","","","","","","","","","","","","","","","","","","","","","","","","","","","","","","","","","","","","","","","","","","","","","","","","","","","","","","","",3,"","","","","","","","","","","","","","","","","","","","","","","","","","","","","","","","","","","","","","","","","","","","","","","","","","","","","","","","","","","","","","","","","","","","","","","","","","","","","","","","","","","","","","","","","","","","","","","","","","","","","","","","","","","","","","","","","","","","","","","",null,"","","","","","","","","","","","","","","","","","","","","","","","","","","","","","","","","","",""]
[1,{"$f":"AO14","v":5},1,null,null,null,null,null,null,null,null,null,null,null,null,null,null,null,null,null,null,null,null,null,null,null,null,null,null,null,null,null,null,null,null,null,null,null,null,"",5,{"$f":"INDEX(liste_des_items_de_francais,AO14)","v":"Identifier des mots rapidement."},1,"","","","","","","","","","","","","","","","","","","","","","","","","","","","","","","","","","","","","","","","","","","","","","","","","","","","","","","","","","","","","","","","","","","","","","","","","","","","","","","","","","","","","","","","","","","","","","","","","","","","","","","","","","","","","","","","","","","","","","","","","","","","","","","","","","","","","","","","","","","","","","","","","","","","","","","","","","","","","","","","","","","","","","","","","","","","","","","","","","","","","","","","","","","","","","","","","","","","","","","","","",5,{"$f":"INDEX(liste_des_items_de_francais,IK14)","v":"Identifier des mots rapidement."},1,"","","","","","","","","","","","","","","","","","","","","","","","","","","","","","","","","","","","","","","","","","","","","","","","","","","","","","","","","","","","","","","","","","","","","","","","","","","","","","","","","","","","","","","","","","","","","","","","","","","","","","","","","","","","","","","","","","","","","","","","","","","","","","","","","","","","","","","","","","","","","","","","","","","","","","","","","","","","","","","","","","","","","","","","","","","","","","","","","","","","","","","","","","","","","","","","","","","","","","","","","",5,{"$f":"INDEX(liste_des_items_de_francais,QG14)","v":"Identifier des mots rapidement."},1,"","","","","","","","","","","","","","","","","","","","","","","","","","","","","","","","","","","","","","","","","","","","","","","","","","","","","","","","","","","","","","","","","","","","","","","","","","","","","","","","","","","","","","","","","","","","","","","","","","","","","","","","","","","","","","","","","","","","","","","","","","","","","","","","","","","","","","","","","","","","","","","","","","","","","","","","","","","","","","","","","","","","","","","","","","","","","","","","","","","","","","","","","","","","","","","","","","","","","","","","",{"$f":"IF(COUNT(E14,E25)=0,\"\",SUM(ZM14,ZM25)/($ZL14*COUNT(E14,E25)))","v":""},{"$f":"IF(COUNT(F14,F25)=0,\"\",SUM(ZN14,ZN25)/($ZL14*COUNT(F14,F25)))","v":""},"","","","","","","","","","","","","","","","","","","","","","","","","","","","","","","","","",{"$f":"IF(OR(ISBLANK(INDEX(liste_des_resultats,ROW()-1,CELL(\"contenu\",'Bilan - élève'!$J$1))),ISERROR(INDEX(liste_des_resultats,ROW()-1,CELL(\"contenu\",'Bilan - élève'!$J$1)))),\"\",INDEX(liste_des_resultats,ROW()-1,CELL(\"contenu\",'Bilan - élève'!$J$1)))","v":""},3,"","","","","","","","","","","","","","","","","","","","","","","","","","","","","","","","","","","",1,2,8,9,0,null,null,null,null,null,null,null,"","","","","","","","","","","","","","","","",3,"","","","","","","","","","","","","","","","","","","","","","","","","","","","","","","","","","","","","","","","","","","","","","","","","","","","","","","","","","","","","","","","","","","","","","","","","","","","","","","","","","","","","","","","","","","","","","","","","","","","","","","","","","","","","","","","","","","","","","","","","","","","","","","","","","","","","","","","","","","","","","","","","","","","","","","","","","","","","","","","","","","","","","","","","","","","","","","","","","","","","","","",null,"","","","","","","","","","","","","","","","","","","","","","","","","","","","","","","","","","",""]
[null,6,2,1,null,null,null,null,null,null,null,null,null,null,null,null,null,null,null,null,null,null,null,null,null,null,null,null,null,null,null,null,null,null,null,null,null,null,null,"",6,"Lire et comprendre des textes adaptés à la maturité et à la culture scolaire des élèves.",1,"","","","","","","","","","","","","","","","","","","","","","","","","","","","","","","","","","","","","","","","","","","","","","","","","","","","","","","","","","","","","","","","","","","","","","","","","","","","","","","","","","","","","","","","","","","","","","","","","","","","","","","","","","","","","","","","","","","","","","","","","","","","","","","","","","","","","","","","","","","","","","","","","","","","","","","","","","","","","","","","","","","","","","","","","","","","","","","","","","","","","","","","","","","","","","","","","","","","","","","","","",6,"Lire et comprendre des textes adaptés à la maturité et à la culture scolaire des élèves.",1,"","","","","","","","","","","","","","","","","","","","","","","","","","","","","","","","","","","","","","","","","","","","","","","","","","","","","","","","","","","","","","","","","","","","","","","","","","","","","","","","","","","","","","","","","","","","","","","","","","","","","","","","","","","","","","","","","","","","","","","","","","","","","","","","","","","","","","","","","","","","","","","","","","","","","","","","","","","","","","","","","","","","","","","","","","","","","","","","","","","","","","","","","","","","","","","","","","","","","","","","","",6,"Lire et comprendre des textes adaptés à la maturité et à la culture scolaire des élèves.",1,"","","","","","","","","","","","","","","","","","","","","","","","","","","","","","","","","","","","","","","","","","","","","","","","","","","","","","","","","","","","","","","","","","","","","","","","","","","","","","","","","","","","","","","","","","","","","","","","","","","","","","","","","","","","","","","","","","","","","","","","","","","","","","","","","","","","","","","","","","","","","","","","","","","","","","","","","","","","","","","","","","","","","","","","","","","","","","","","","","","","","","","","","","","","","","","","","","","","","","","","",{"$f":"IF(COUNT(E15:E24)=0,\"\",SUM(ZM15:ZM24)/($ZL15*COUNT(E15:E24)))","v":""},{"$f":"IF(COUNT(F15:F24)=0,\"\",SUM(ZN15:ZN24)/($ZL15*COUNT(F15:F24)))","v":""},"","","","","","","","","","","","","","","","","","","","","","","","","","","","","","","","","",{"$f":"IF(OR(ISBLANK(INDEX(liste_des_resultats,ROW()-1,CELL(\"contenu\",'Bilan - élève'!$J$1))),ISERROR(INDEX(liste_des_resultats,ROW()-1,CELL(\"contenu\",'Bilan - élève'!$J$1)))),\"\",INDEX(liste_des_resultats,ROW()-1,CELL(\"contenu\",'Bilan - élève'!$J$1)))","v":""},3,"","","","","","","","","","","","","","","","","","","","","","","","","","","","","","","","","","","",1,9,0,null,null,null,null,null,null,null,null,null,"","","","","","","","","","","","","","","","","","","","",3,"","","","","","","","","","","","","","","","","","","","","","","","","","","","","","","","","","","","","","","","","","","","","","","","","","","","","","","","","","","","","","","","","","","","","","","","","","","","","","","","","","","","","","","","","","","","","","","","","","","","","","","","","","","","","","","","","","","","","","","","","","","","","","","","","","","","","","","","","","","","","","","","","","","","","","","","","","","","","","","","","","","","","","","","","","","","","","","","","","","",null,"","","","","","","","","","","","","","","","","","","","","","","","","","","","","","","","","","",""]
[null,6,null,2,null,null,null,null,null,null,null,null,null,null,null,null,null,null,null,null,null,null,null,null,null,null,null,null,null,null,null,null,null,null,null,null,null,null,null,"",6,"Lire et comprendre des textes adaptés à la maturité et à la culture scolaire des élèves.",1,"","","","","","","","","","","","","","","","","","","","","","","","","","","","","","","","","","","","","","","","","","","","","","","","","","","","","","","","","","","","","","","","","","","","","","","","","","","","","","","","","","","","","","","","","","","","","","","","","","","","","","","","","","","","","","","","","","","","","","","","","","","","","","","","","","","","","","","","","","","","","","","","","","","","","","","","","","","","","","","","","","","","","","","","","","","","","","","","","","","","","","","","","","","","","","","","","","","","","","","","","",6,"Lire et comprendre des textes adaptés à la maturité et à la culture scolaire des élèves.",1,"","","","","","","","","","","","","","","","","","","","","","","","","","","","","","","","","","","","","","","","","","","","","","","","","","","","","","","","","","","","","","","","","","","","","","","","","","","","","","","","","","","","","","","","","","","","","","","","","","","","","","","","","","","","","","","","","","","","","","","","","","","","","","","","","","","","","","","","","","","","","","","","","","","","","","","","","","","","","","","","","","","","","","","","","","","","","","","","","","","","","","","","","","","","","","","","","","","","","","","","","",6,"Lire et comprendre des textes adaptés à la maturité et à la culture scolaire des élèves.",1,"","","","","","","","","","","","","","","","","","","","","","","","","","","","","","","","","","","","","","","","","","","","","","","","","","","","","","","","","","","","","","","","","","","","","","","","","","","","","","","","","","","","","","","","","","","","","","","","","","","","","","","","","","","","","","","","","","","","","","","","","","","","","","","","","","","","","","","","","","","","","","","","","","","","","","","","","","","","","","","","","","","","","","","","","","","","","","","","","","","","","","","","","","","","","","","","","","","","","","","","",null,null,null,null,null,null,null,null,null,null,null,null,null,null,null,null,null,null,null,null,null,null,null,null,null,null,null,null,null,null,null,null,null,null,null,{"$f":"IF(OR(ISBLANK(INDEX(liste_des_resultats,ROW()-1,CELL(\"contenu\",'Bilan - élève'!$J$1))),ISERROR(INDEX(liste_des_resultats,ROW()-1,CELL(\"contenu\",'Bilan - élève'!$J$1)))),\"\",INDEX(liste_des_resultats,ROW()-1,CELL(\"contenu\",'Bilan - élève'!$J$1)))","v":""},3,"","","","","","","","","","","","","","","","","","","","","","","","","","","","","","","","","","","",1,9,0,null,null,null,null,null,null,null,null,null,"","","","","","","","","","","","","","","","","","","","",3,"","","","","","","","","","","","","","","","","","","","","","","","","","","","","","","","","","","","","","","","","","","","","","","","","","","","","","","","","","","","","","","","","","","","","","","","","","","","","","","","","","","","","","","","","","","","","","","","","","","","","","","","","","","","","","","","","","","","","","","","","","","","","","","","","","","","","","","","","","","","","","","","","","","","","","","","","","","","","","","","","","","","","","","","","","","","","","","","","","","",null,"","","","","","","","","","","","","","","","","","","","","","","","","","","","","","","","","","",""]
[null,6,null,3,null,null,null,null,null,null,null,null,null,null,null,null,null,null,null,null,null,null,null,null,null,null,null,null,null,null,null,null,null,null,null,null,null,null,null,"",6,"Lire et comprendre des textes adaptés à la maturité et à la culture scolaire des élèves.",1,"","","","","","","","","","","","","","","","","","","","","","","","","","","","","","","","","","","","","","","","","","","","","","","","","","","","","","","","","","","","","","","","","","","","","","","","","","","","","","","","","","","","","","","","","","","","","","","","","","","","","","","","","","","","","","","","","","","","","","","","","","","","","","","","","","","","","","","","","","","","","","","","","","","","","","","","","","","","","","","","","","","","","","","","","","","","","","","","","","","","","","","","","","","","","","","","","","","","","","","","","",6,"Lire et comprendre des textes adaptés à la maturité et à la culture scolaire des élèves.",1,"","","","","","","","","","","","","","","","","","","","","","","","","","","","","","","","","","","","","","","","","","","","","","","","","","","","","","","","","","","","","","","","","","","","","","","","","","","","","","","","","","","","","","","","","","","","","","","","","","","","","","","","","","","","","","","","","","","","","","","","","","","","","","","","","","","","","","","","","","","","","","","","","","","","","","","","","","","","","","","","","","","","","","","","","","","","","","","","","","","","","","","","","","","","","","","","","","","","","","","","","",6,"Lire et comprendre des textes adaptés à la maturité et à la culture scolaire des élèves.",1,"","","","","","","","","","","","","","","","","","","","","","","","","","","","","","","","","","","","","","","","","","","","","","","","","","","","","","","","","","","","","","","","","","","","","","","","","","","","","","","","","","","","","","","","","","","","","","","","","","","","","","","","","","","","","","","","","","","","","","","","","","","","","","","","","","","","","","","","","","","","","","","","","","","","","","","","","","","","","","","","","","","","","","","","","","","","","","","","","","","","","","","","","","","","","","","","","","","","","","","","",null,null,null,null,null,null,null,null,null,null,null,null,null,null,null,null,null,null,null,null,null,null,null,null,null,null,null,null,null,null,null,null,null,null,null,{"$f":"IF(OR(ISBLANK(INDEX(liste_des_resultats,ROW()-1,CELL(\"contenu\",'Bilan - élève'!$J$1))),ISERROR(INDEX(liste_des_resultats,ROW()-1,CELL(\"contenu\",'Bilan - élève'!$J$1)))),\"\",INDEX(liste_des_resultats,ROW()-1,CELL(\"contenu\",'Bilan - élève'!$J$1)))","v":""},3,"","","","","","","","","","","","","","","","","","","","","","","","","","","","","","","","","","","",1,9,0,null,null,null,null,null,null,null,null,null,"","","","","","","","","","","","","","","","","","","","",3,"","","","","","","","","","","","","","","","","","","","","","","","","","","","","","","","","","","","","","","","","","","","","","","","","","","","","","","","","","","","","","","","","","","","","","","","","","","","","","","","","","","","","","","","","","","","","","","","","","","","","","","","","","","","","","","","","","","","","","","","","","","","","","","","","","","","","","","","","","","","","","","","","","","","","","","","","","","","","","","","","","","","","","","","","","","","","","","","","","","",null,"","","","","","","","","","","","","","","","","","","","","","","","","","","","","","","","","","",""]
[null,6,null,4,null,null,null,null,null,null,null,null,null,null,null,null,null,null,null,null,null,null,null,null,null,null,null,null,null,null,null,null,null,null,null,null,null,null,null,"",6,"Lire et comprendre des textes adaptés à la maturité et à la culture scolaire des élèves.",1,"","","","","","","","","","","","","","","","","","","","","","","","","","","","","","","","","","","","","","","","","","","","","","","","","","","","","","","","","","","","","","","","","","","","","","","","","","","","","","","","","","","","","","","","","","","","","","","","","","","","","","","","","","","","","","","","","","","","","","","","","","","","","","","","","","","","","","","","","","","","","","","","","","","","","","","","","","","","","","","","","","","","","","","","","","","","","","","","","","","","","","","","","","","","","","","","","","","","","","","","","",6,"Lire et comprendre des textes adaptés à la maturité et à la culture scolaire des élèves.",1,"","","","","","","","","","","","","","","","","","","","","","","","","","","","","","","","","","","","","","","","","","","","","","","","","","","","","","","","","","","","","","","","","","","","","","","","","","","","","","","","","","","","","","","","","","","","","","","","","","","","","","","","","","","","","","","","","","","","","","","","","","","","","","","","","","","","","","","","","","","","","","","","","","","","","","","","","","","","","","","","","","","","","","","","","","","","","","","","","","","","","","","","","","","","","","","","","","","","","","","","","",6,"Lire et comprendre des textes adaptés à la maturité et à la culture scolaire des élèves.",1,"","","","","","","","","","","","","","","","","","","","","","","","","","","","","","","","","","","","","","","","","","","","","","","","","","","","","","","","","","","","","","","","","","","","","","","","","","","","","","","","","","","","","","","","","","","","","","","","","","","","","","","","","","","","","","","","","","","","","","","","","","","","","","","","","","","","","","","","","","","","","","","","","","","","","","","","","","","","","","","","","","","","","","","","","","","","","","","","","","","","","","","","","","","","","","","","","","","","","","","","",null,null,null,null,null,null,null,null,null,null,null,null,null,null,null,null,null,null,null,null,null,null,null,null,null,null,null,null,null,null,null,null,null,null,null,{"$f":"IF(OR(ISBLANK(INDEX(liste_des_resultats,ROW()-1,CELL(\"contenu\",'Bilan - élève'!$J$1))),ISERROR(INDEX(liste_des_resultats,ROW()-1,CELL(\"contenu\",'Bilan - élève'!$J$1)))),\"\",INDEX(liste_des_resultats,ROW()-1,CELL(\"contenu\",'Bilan - élève'!$J$1)))","v":""},3,"","","","","","","","","","","","","","","","","","","","","","","","","","","","","","","","","","","",1,9,0,null,null,null,null,null,null,null,null,null,"","","","","","","","","","","","","","","","","","","","",3,"","","","","","","","","","","","","","","","","","","","","","","","","","","","","","","","","","","","","","","","","","","","","","","","","","","","","","","","","","","","","","","","","","","","","","","","","","","","","","","","","","","","","","","","","","","","","","","","","","","","","","","","","","","","","","","","","","","","","","","","","","","","","","","","","","","","","","","","","","","","","","","","","","","","","","","","","","","","","","","","","","","","","","","","","","","","","","","","","","","",null,"","","","","","","","","","","","","","","","","","","","","","","","","","","","","","","","","","",""]
[null,6,null,5,null,null,null,null,null,null,null,null,null,null,null,null,null,null,null,null,null,null,null,null,null,null,null,null,null,null,null,null,null,null,null,null,null,null,null,"",6,"Lire et comprendre des textes adaptés à la maturité et à la culture scolaire des élèves.",1,"","","","","","","","","","","","","","","","","","","","","","","","","","","","","","","","","","","","","","","","","","","","","","","","","","","","","","","","","","","","","","","","","","","","","","","","","","","","","","","","","","","","","","","","","","","","","","","","","","","","","","","","","","","","","","","","","","","","","","","","","","","","","","","","","","","","","","","","","","","","","","","","","","","","","","","","","","","","","","","","","","","","","","","","","","","","","","","","","","","","","","","","","","","","","","","","","","","","","","","","","",6,"Lire et comprendre des textes adaptés à la maturité et à la culture scolaire des élèves.",1,"","","","","","","","","","","","","","","","","","","","","","","","","","","","","","","","","","","","","","","","","","","","","","","","","","","","","","","","","","","","","","","","","","","","","","","","","","","","","","","","","","","","","","","","","","","","","","","","","","","","","","","","","","","","","","","","","","","","","","","","","","","","","","","","","","","","","","","","","","","","","","","","","","","","","","","","","","","","","","","","","","","","","","","","","","","","","","","","","","","","","","","","","","","","","","","","","","","","","","","","","",6,"Lire et comprendre des textes adaptés à la maturité et à la culture scolaire des élèves.",1,"","","","","","","","","","","","","","","","","","","","","","","","","","","","","","","","","","","","","","","","","","","","","","","","","","","","","","","","","","","","","","","","","","","","","","","","","","","","","","","","","","","","","","","","","","","","","","","","","","","","","","","","","","","","","","","","","","","","","","","","","","","","","","","","","","","","","","","","","","","","","","","","","","","","","","","","","","","","","","","","","","","","","","","","","","","","","","","","","","","","","","","","","","","","","","","","","","","","","","","","",null,null,null,null,null,null,null,null,null,null,null,null,null,null,null,null,null,null,null,null,null,null,null,null,null,null,null,null,null,null,null,null,null,null,null,{"$f":"IF(OR(ISBLANK(INDEX(liste_des_resultats,ROW()-1,CELL(\"contenu\",'Bilan - élève'!$J$1))),ISERROR(INDEX(liste_des_resultats,ROW()-1,CELL(\"contenu\",'Bilan - élève'!$J$1)))),\"\",INDEX(liste_des_resultats,ROW()-1,CELL(\"contenu\",'Bilan - élève'!$J$1)))","v":""},3,"","","","","","","","","","","","","","","","","","","","","","","","","","","","","","","","","","","",1,9,0,null,null,null,null,null,null,null,null,null,"","","","","","","","","","","","","","","","","","","","",3,"","","","","","","","","","","","","","","","","","","","","","","","","","","","","","","","","","","","","","","","","","","","","","","","","","","","","","","","","","","","","","","","","","","","","","","","","","","","","","","","","","","","","","","","","","","","","","","","","","","","","","","","","","","","","","","","","","","","","","","","","","","","","","","","","","","","","","","","","","","","","","","","","","","","","","","","","","","","","","","","","","","","","","","","","","","","","","","","","","","",null,"","","","","","","","","","","","","","","","","","","","","","","","","","","","","","","","","","",""]
[null,6,3,1,null,null,null,null,null,null,null,null,null,null,null,null,null,null,null,null,null,null,null,null,null,null,null,null,null,null,null,null,null,null,null,null,null,null,null,"",6,"Lire et comprendre des textes adaptés à la maturité et à la culture scolaire des élèves.",2,"","","","","","","","","","","","","","","","","","","","","","","","","","","","","","","","","","","","","","","","","","","","","","","","","","","","","","","","","","","","","","","","","","","","","","","","","","","","","","","","","","","","","","","","","","","","","","","","","","","","","","","","","","","","","","","","","","","","","","","","","","","","","","","","","","","","","","","","","","","","","","","","","","","","","","","","","","","","","","","","","","","","","","","","","","","","","","","","","","","","","","","","","","","","","","","","","","","","","","","","","",6,"Lire et comprendre des textes adaptés à la maturité et à la culture scolaire des élèves.",2,"","","","","","","","","","","","","","","","","","","","","","","","","","","","","","","","","","","","","","","","","","","","","","","","","","","","","","","","","","","","","","","","","","","","","","","","","","","","","","","","","","","","","","","","","","","","","","","","","","","","","","","","","","","","","","","","","","","","","","","","","","","","","","","","","","","","","","","","","","","","","","","","","","","","","","","","","","","","","","","","","","","","","","","","","","","","","","","","","","","","","","","","","","","","","","","","","","","","","","","","","",6,"Lire et comprendre des textes adaptés à la maturité et à la culture scolaire des élèves.",2,"","","","","","","","","","","","","","","","","","","","","","","","","","","","","","","","","","","","","","","","","","","","","","","","","","","","","","","","","","","","","","","","","","","","","","","","","","","","","","","","","","","","","","","","","","","","","","","","","","","","","","","","","","","","","","","","","","","","","","","","","","","","","","","","","","","","","","","","","","","","","","","","","","","","","","","","","","","","","","","","","","","","","","","","","","","","","","","","","","","","","","","","","","","","","","","","","","","","","","","","",null,null,null,null,null,null,null,null,null,null,null,null,null,null,null,null,null,null,null,null,null,null,null,null,null,null,null,null,null,null,null,null,null,null,null,{"$f":"IF(OR(ISBLANK(INDEX(liste_des_resultats,ROW()-1,CELL(\"contenu\",'Bilan - élève'!$J$1))),ISERROR(INDEX(liste_des_resultats,ROW()-1,CELL(\"contenu\",'Bilan - élève'!$J$1)))),\"\",INDEX(liste_des_resultats,ROW()-1,CELL(\"contenu\",'Bilan - élève'!$J$1)))","v":""},3,"","","","","","","","","","","","","","","","","","","","","","","","","","","","","","","","","","","",1,9,0,null,null,null,null,null,null,null,null,null,"","","","","","","","","","","","","","","","","","","","","",3,"","","","","","","","","","","","","","","","","","","","","","","","","","","","","","","","","","","","","","","","","","","","","","","","","","","","","","","","","","","","","","","","","","","","","","","","","","","","","","","","","","","","","","","","","","","","","","","","","","","","","","","","","","","","","","","","","","","","","","","","","","","","","","","","","","","","","","","","","","","","","","","","","","","","","","","","","","","","","","","","","","","","","","","","","","","","","","","","","","",null,"","","","","","","","","","","","","","","","","","","","","","","","","","","","","","","","","","",""]
[null,6,null,2,null,null,null,null,null,null,null,null,null,null,null,null,null,null,null,null,null,null,null,null,null,null,null,null,null,null,null,null,null,null,null,null,null,null,null,"",6,"Lire et comprendre des textes adaptés à la maturité et à la culture scolaire des élèves.",2,"","","","","","","","","","","","","","","","","","","","","","","","","","","","","","","","","","","","","","","","","","","","","","","","","","","","","","","","","","","","","","","","","","","","","","","","","","","","","","","","","","","","","","","","","","","","","","","","","","","","","","","","","","","","","","","","","","","","","","","","","","","","","","","","","","","","","","","","","","","","","","","","","","","","","","","","","","","","","","","","","","","","","","","","","","","","","","","","","","","","","","","","","","","","","","","","","","","","","","","","","",6,"Lire et comprendre des textes adaptés à la maturité et à la culture scolaire des élèves.",2,"","","","","","","","","","","","","","","","","","","","","","","","","","","","","","","","","","","","","","","","","","","","","","","","","","","","","","","","","","","","","","","","","","","","","","","","","","","","","","","","","","","","","","","","","","","","","","","","","","","","","","","","","","","","","","","","","","","","","","","","","","","","","","","","","","","","","","","","","","","","","","","","","","","","","","","","","","","","","","","","","","","","","","","","","","","","","","","","","","","","","","","","","","","","","","","","","","","","","","","","","",6,"Lire et comprendre des textes adaptés à la maturité et à la culture scolaire des élèves.",2,"","","","","","","","","","","","","","","","","","","","","","","","","","","","","","","","","","","","","","","","","","","","","","","","","","","","","","","","","","","","","","","","","","","","","","","","","","","","","","","","","","","","","","","","","","","","","","","","","","","","","","","","","","","","","","","","","","","","","","","","","","","","","","","","","","","","","","","","","","","","","","","","","","","","","","","","","","","","","","","","","","","","","","","","","","","","","","","","","","","","","","","","","","","","","","","","","","","","","","","","",null,null,null,null,null,null,null,null,null,null,null,null,null,null,null,null,null,null,null,null,null,null,null,null,null,null,null,null,null,null,null,null,null,null,null,{"$f":"IF(OR(ISBLANK(INDEX(liste_des_resultats,ROW()-1,CELL(\"contenu\",'Bilan - élève'!$J$1))),ISERROR(INDEX(liste_des_resultats,ROW()-1,CELL(\"contenu\",'Bilan - élève'!$J$1)))),\"\",INDEX(liste_des_resultats,ROW()-1,CELL(\"contenu\",'Bilan - élève'!$J$1)))","v":""},3,"","","","","","","","","","","","","","","","","","","","","","","","","","","","","","","","","","","",1,9,0,null,null,null,null,null,null,null,null,null,"","","","","","","","","","","","","","","","","","","","","",3,"","","","","","","","","","","","","","","","","","","","","","","","","","","","","","","","","","","","","","","","","","","","","","","","","","","","","","","","","","","","","","","","","","","","","","","","","","","","","","","","","","","","","","","","","","","","","","","","","","","","","","","","","","","","","","","","","","","","","","","","","","","","","","","","","","","","","","","","","","","","","","","","","","","","","","","","","","","","","","","","","","","","","","","","","","","","","","","","","","",null,"","","","","","","","","","","","","","","","","","","","","","","","","","","","","","","","","","",""]
[null,6,null,3,null,null,null,null,null,null,null,null,null,null,null,null,null,null,null,null,null,null,null,null,null,null,null,null,null,null,null,null,null,null,null,null,null,null,null,"",6,"Lire et comprendre des textes adaptés à la maturité et à la culture scolaire des élèves.",2,{"$f":"IF(AND(AR$1=$AO22,AR$32=$AQ22),$AN22,\"\")","v":""},"","","","","","","","","",{"$f":"IF(AND(BB$1=$AO22,BB$32=$AQ22),$AN22,\"\")","v":""},"","","","","","","","","",{"$f":"IF(AND(BL$1=$AO22,BL$32=$AQ22),$AN22,\"\")","v":""},"","","","","","","","","",{"$f":"IF(AND(BV$1=$AO22,BV$32=$AQ22),$AN22,\"\")","v":""},"","","","","","","","","",{"$f":"IF(AND(CF$1=$AO22,CF$32=$AQ22),$AN22,\"\")","v":""},"","","","","","","","","",{"$f":"IF(AND(CP$1=$AO22,CP$32=$AQ22),$AN22,\"\")","v":""},"","","","","","","","","",{"$f":"IF(AND(CZ$1=$AO22,CZ$32=$AQ22),$AN22,\"\")","v":""},"","","","","","","","","",{"$f":"IF(AND(DJ$1=$AO22,DJ$32=$AQ22),$AN22,\"\")","v":""},"","","","","","","","","",{"$f":"IF(AND(DT$1=$AO22,DT$32=$AQ22),$AN22,\"\")","v":""},"","","","","","","","","",{"$f":"IF(AND(ED$1=$AO22,ED$32=$AQ22),$AN22,\"\")","v":""},"","","","","","","","","",{"$f":"IF(AND(EN$1=$AO22,EN$32=$AQ22),$AN22,\"\")","v":""},"","","","","","","","","",{"$f":"IF(AND(EX$1=$AO22,EX$32=$AQ22),$AN22,\"\")","v":""},"","","","","","","","","",{"$f":"IF(AND(FH$1=$AO22,FH$32=$AQ22),$AN22,\"\")","v":""},"","","","","","","","","",{"$f":"IF(AND(FR$1=$AO22,FR$32=$AQ22),$AN22,\"\")","v":""},"","","","","","","","","",{"$f":"IF(AND(GB$1=$AO22,GB$32=$AQ22),$AN22,\"\")","v":""},"","","","","","","","","",{"$f":"IF(AND(GL$1=$AO22,GL$32=$AQ22),$AN22,\"\")","v":""},"","","","","","","","","",{"$f":"IF(AND(GV$1=$AO22,GV$32=$AQ22),$AN22,\"\")","v":""},"","","","","","","","","",{"$f":"IF(AND(HF$1=$AO22,HF$32=$AQ22),$AN22,\"\")","v":""},"","","","","","","","","",{"$f":"IF(AND(HP$1=$AO22,HP$32=$AQ22),$AN22,\"\")","v":""},"","","","","","","","","",{"$f":"IF(AND(HZ$1=$AO22,HZ$32=$AQ22),$AN22,\"\")","v":""},"","","","","","","","","","",6,"Lire et comprendre des textes adaptés à la maturité et à la culture scolaire des élèves.",2,{"$f":"IF(AND(IN$1=$AO22,IN$32=$AQ22,ISNUMBER($IJ22)),$IJ22*$ZL22,\"\")","v":""},"","","","","","","","","",{"$f":"IF(AND(IX$1=$AO22,IX$32=$AQ22,ISNUMBER($IJ22)),$IJ22*$ZL22,\"\")","v":""},"","","","","","","","","",{"$f":"IF(AND(JH$1=$AO22,JH$32=$AQ22,ISNUMBER($IJ22)),$IJ22*$ZL22,\"\")","v":""},"","","","","","","","","",{"$f":"IF(AND(JR$1=$AO22,JR$32=$AQ22,ISNUMBER($IJ22)),$IJ22*$ZL22,\"\")","v":""},"","","","","","","","","",{"$f":"IF(AND(KB$1=$AO22,KB$32=$AQ22,ISNUMBER($IJ22)),$IJ22*$ZL22,\"\")","v":""},"","","","","","","","","",{"$f":"IF(AND(KL$1=$AO22,KL$32=$AQ22,ISNUMBER($IJ22)),$IJ22*$ZL22,\"\")","v":""},"","","","","","","","","",{"$f":"IF(AND(KV$1=$AO22,KV$32=$AQ22,ISNUMBER($IJ22)),$IJ22*$ZL22,\"\")","v":""},"","","","","","","","","",{"$f":"IF(AND(LF$1=$AO22,LF$32=$AQ22,ISNUMBER($IJ22)),$IJ22*$ZL22,\"\")","v":""},"","","","","","","","","",{"$f":"IF(AND(LP$1=$AO22,LP$32=$AQ22,ISNUMBER($IJ22)),$IJ22*$ZL22,\"\")","v":""},"","","","","","","","","",{"$f":"IF(AND(LZ$1=$AO22,LZ$32=$AQ22,ISNUMBER($IJ22)),$IJ22*$ZL22,\"\")","v":""},"","","","","","","","","",{"$f":"IF(AND(MJ$1=$AO22,MJ$32=$AQ22,ISNUMBER($IJ22)),$IJ22*$ZL22,\"\")","v":""},"","","","","","","","","",{"$f":"IF(AND(MT$1=$AO22,MT$32=$AQ22,ISNUMBER($IJ22)),$IJ22*$ZL22,\"\")","v":""},"","","","","","","","","",{"$f":"IF(AND(ND$1=$AO22,ND$32=$AQ22,ISNUMBER($IJ22)),$IJ22*$ZL22,\"\")","v":""},"","","","","","","","","",{"$f":"IF(AND(NN$1=$AO22,NN$32=$AQ22,ISNUMBER($IJ22)),$IJ22*$ZL22,\"\")","v":""},"","","","","","","","","",{"$f":"IF(AND(NX$1=$AO22,NX$32=$AQ22,ISNUMBER($IJ22)),$IJ22*$ZL22,\"\")","v":""},"","","","","","","","","",{"$f":"IF(AND(OH$1=$AO22,OH$32=$AQ22,ISNUMBER($IJ22)),$IJ22*$ZL22,\"\")","v":""},"","","","","","","","","",{"$f":"IF(AND(OR$1=$AO22,OR$32=$AQ22,ISNUMBER($IJ22)),$IJ22*$ZL22,\"\")","v":""},"","","","","","","","","",{"$f":"IF(AND(PB$1=$AO22,PB$32=$AQ22,ISNUMBER($IJ22)),$IJ22*$ZL22,\"\")","v":""},"","","","","","","","","",{"$f":"IF(AND(PL$1=$AO22,PL$32=$AQ22,ISNUMBER($IJ22)),$IJ22*$ZL22,\"\")","v":""},"","","","","","","","","",{"$f":"IF(AND(PV$1=$AO22,PV$32=$AQ22,ISNUMBER($IJ22)),$IJ22*$ZL22,\"\")","v":""},"","","","","","","","","","",6,"Lire et comprendre des textes adaptés à la maturité et à la culture scolaire des élèves.",2,{"$f":"IF(AND(QJ$1=$AO22,QJ$32=$AQ22),$QF22,\"\")","v":""},"","","","","","","","","",{"$f":"IF(AND(QT$1=$AO22,QT$32=$AQ22),$QF22,\"\")","v":""},"","","","","","","","","",{"$f":"IF(AND(RD$1=$AO22,RD$32=$AQ22),$QF22,\"\")","v":""},"","","","","","","","","",{"$f":"IF(AND(RN$1=$AO22,RN$32=$AQ22),$QF22,\"\")","v":""},"","","","","","","","","",{"$f":"IF(AND(RX$1=$AO22,RX$32=$AQ22),$QF22,\"\")","v":""},"","","","","","","","","",{"$f":"IF(AND(SH$1=$AO22,SH$32=$AQ22),$QF22,\"\")","v":""},"","","","","","","","","",{"$f":"IF(AND(SR$1=$AO22,SR$32=$AQ22),$QF22,\"\")","v":""},"","","","","","","","","",{"$f":"IF(AND(TB$1=$AO22,TB$32=$AQ22),$QF22,\"\")","v":""},"","","","","","","","","",{"$f":"IF(AND(TL$1=$AO22,TL$32=$AQ22),$QF22,\"\")","v":""},"","","","","","","","","",{"$f":"IF(AND(TV$1=$AO22,TV$32=$AQ22),$QF22,\"\")","v":""},"","","","","","","","","",{"$f":"IF(AND(UF$1=$AO22,UF$32=$AQ22),$QF22,\"\")","v":""},"","","","","","","","","",{"$f":"IF(AND(UP$1=$AO22,UP$32=$AQ22),$QF22,\"\")","v":""},"","","","","","","","","",{"$f":"IF(AND(UZ$1=$AO22,UZ$32=$AQ22),$QF22,\"\")","v":""},"","","","","","","","","",{"$f":"IF(AND(VJ$1=$AO22,VJ$32=$AQ22),$QF22,\"\")","v":""},"","","","","","","","","",{"$f":"IF(AND(VT$1=$AO22,VT$32=$AQ22),$QF22,\"\")","v":""},"","","","","","","","","",{"$f":"IF(AND(WD$1=$AO22,WD$32=$AQ22),$QF22,\"\")","v":""},"","","","","","","","","",{"$f":"IF(AND(WN$1=$AO22,WN$32=$AQ22),$QF22,\"\")","v":""},"","","","","","","","","",{"$f":"IF(AND(WX$1=$AO22,WX$32=$AQ22),$QF22,\"\")","v":""},"","","","","","","","","",{"$f":"IF(AND(XH$1=$AO22,XH$32=$AQ22),$QF22,\"\")","v":""},"","","","","","","","","",{"$f":"IF(AND(XR$1=$AO22,XR$32=$AQ22),$QF22,\"\")","v":""},"","","","","","","","","",null,null,null,null,null,null,null,null,null,null,null,null,null,null,null,null,null,null,null,null,null,null,null,null,null,null,null,null,null,null,null,null,null,null,null,{"$f":"IF(OR(ISBLANK(INDEX(liste_des_resultats,ROW()-1,CELL(\"contenu\",'Bilan - élève'!$J$1))),ISERROR(INDEX(liste_des_resultats,ROW()-1,CELL(\"contenu\",'Bilan - élève'!$J$1)))),\"\",INDEX(liste_des_resultats,ROW()-1,CELL(\"contenu\",'Bilan - élève'!$J$1)))","v":""},3,"","","","","","","","","","","","","","","","","","","","","","","","","","","","","","","","","","","",1,9,0,null,null,null,null,null,null,null,null,null,"","","","","","","","","","","","","","","","","","","","","",3,"","","","","","","","","","","","","","","","","","","","","","","","","","","","","","","","","","","","","","","","","","","","","","","","","","","","","","","","","","","","","","","","","","","","","","","","","","","","","","","","","","","","","","","","","","","","","","","","","","","","","","","","","","","","","","","","","","","","","","","","","","","","","","","","","","","","","","","","","","","","","","","","","","","","","","","","","","","","","","","","","","","","","","","","","","","","","","","","","","",null,"","","","","","","","","","","","","","","","","","","","","","","","","","","","","","","","","","",""]
[null,6,null,4,null,null,null,null,null,null,null,null,null,null,null,null,null,null,null,null,null,null,null,null,null,null,null,null,null,null,null,null,null,null,null,null,null,null,null,"",6,"Lire et comprendre des textes adaptés à la maturité et à la culture scolaire des élèves.",2,"","","","","","","","","","","","","","","","","","","","","","","","","","","","","","","","","","","","","","","","","","","","","","","","","","","","","","","","","","","","","","","","","","","","","","","","","","","","","","","","","","","","","","","","","","","","","","","","","","","","","","","","","","","","","","","","","","","","","","","","","","","","","","","","","","","","","","","","","","","","","","","","","","","","","","","","","","","","","","","","","","","","","","","","","","","","","","","","","","","","","","","","","","","","","","","","","","","","","","","","","",6,"Lire et comprendre des textes adaptés à la maturité et à la culture scolaire des élèves.",2,"","","","","","","","","","","","","","","","","","","","","","","","","","","","","","","","","","","","","","","","","","","","","","","","","","","","","","","","","","","","","","","","","","","","","","","","","","","","","","","","","","","","","","","","","","","","","","","","","","","","","","","","","","","","","","","","","","","","","","","","","","","","","","","","","","","","","","","","","","","","","","","","","","","","","","","","","","","","","","","","","","","","","","","","","","","","","","","","","","","","","","","","","","","","","","","","","","","","","","","","","",6,"Lire et comprendre des textes adaptés à la maturité et à la culture scolaire des élèves.",2,"","","","","","","","","","","","","","","","","","","","","","","","","","","","","","","","","","","","","","","","","","","","","","","","","","","","","","","","","","","","","","","","","","","","","","","","","","","","","","","","","","","","","","","","","","","","","","","","","","","","","","","","","","","","","","","","","","","","","","","","","","","","","","","","","","","","","","","","","","","","","","","","","","","","","","","","","","","","","","","","","","","","","","","","","","","","","","","","","","","","","","","","","","","","","","","","","","","","","","","","",null,null,null,null,null,null,null,null,null,null,null,null,null,null,null,null,null,null,null,null,null,null,null,null,null,null,null,null,null,null,null,null,null,null,null,{"$f":"IF(OR(ISBLANK(INDEX(liste_des_resultats,ROW()-1,CELL(\"contenu\",'Bilan - élève'!$J$1))),ISERROR(INDEX(liste_des_resultats,ROW()-1,CELL(\"contenu\",'Bilan - élève'!$J$1)))),\"\",INDEX(liste_des_resultats,ROW()-1,CELL(\"contenu\",'Bilan - élève'!$J$1)))","v":""},3,"","","","","","","","","","","","","","","","","","","","","","","","","","","","","","","","","","","",1,9,0,null,null,null,null,null,null,null,null,null,"","","","","","","","","","","","","","","","","","","","","",3,"","","","","","","","","","","","","","","","","","","","","","","","","","","","","","","","","","","","","","","","","","","","","","","","","","","","","","","","","","","","","","","","","","","","","","","","","","","","","","","","","","","","","","","","","","","","","","","","","","","","","","","","","","","","","","","","","","","","","","","","","","","","","","","","","","","","","","","","","","","","","","","","","","","","","","","","","","","","","","","","","","","","","","","","","","","","","","","","","","",null,"","","","","","","","","","","","","","","","","","","","","","","","","","","","","","","","","","",""]
[null,6,null,5,null,null,null,null,null,null,null,null,null,null,null,null,null,null,null,null,null,null,null,null,null,null,null,null,null,null,null,null,null,null,null,null,null,null,null,"",6,"Lire et comprendre des textes adaptés à la maturité et à la culture scolaire des élèves.",2,"","","","","","","","","","","","","","","","","","","","","","","","","","","","","","","","","","","","","","","","","","","","","","","","","","","","","","","","","","","","","","","","","","","","","","","","","","","","","","","","","","","","","","","","","","","","","","","","","","","","","","","","","","","","","","","","","","","","","","","","","","","","","","","","","","","","","","","","","","","","","","","","","","","","","","","","","","","","","","","","","","","","","","","","","","","","","","","","","","","","","","","","","","","","","","","","","","","","","","","","","",6,"Lire et comprendre des textes adaptés à la maturité et à la culture scolaire des élèves.",2,"","","","","","","","","","","","","","","","","","","","","","","","","","","","","","","","","","","","","","","","","","","","","","","","","","","","","","","","","","","","","","","","","","","","","","","","","","","","","","","","","","","","","","","","","","","","","","","","","","","","","","","","","","","","","","","","","","","","","","","","","","","","","","","","","","","","","","","","","","","","","","","","","","","","","","","","","","","","","","","","","","","","","","","","","","","","","","","","","","","","","","","","","","","","","","","","","","","","","","","","","",6,"Lire et comprendre des textes adaptés à la maturité et à la culture scolaire des élèves.",2,"","","","","","","","","","","","","","","","","","","","","","","","","","","","","","","","","","","","","","","","","","","","","","","","","","","","","","","","","","","","","","","","","","","","","","","","","","","","","","","","","","","","","","","","","","","","","","","","","","","","","","","","","","","","","","","","","","","","","","","","","","","","","","","","","","","","","","","","","","","","","","","","","","","","","","","","","","","","","","","","","","","","","","","","","","","","","","","","","","","","","","","","","","","","","","","","","","","","","","","","",null,null,null,null,null,null,null,null,null,null,null,null,null,null,null,null,null,null,null,null,null,null,null,null,null,null,null,null,null,null,null,null,null,null,null,{"$f":"IF(OR(ISBLANK(INDEX(liste_des_resultats,ROW()-1,CELL(\"contenu\",'Bilan - élève'!$J$1))),ISERROR(INDEX(liste_des_resultats,ROW()-1,CELL(\"contenu\",'Bilan - élève'!$J$1)))),\"\",INDEX(liste_des_resultats,ROW()-1,CELL(\"contenu\",'Bilan - élève'!$J$1)))","v":""},3,"","","","","","","","","","","","","","","","","","","","","","","","","","","","","","","","","","","",1,9,0,null,null,null,null,null,null,null,null,null,"","","","","","","","","","","","","","","","","","","","","",3,"","","","","","","","","","","","","","","","","","","","","","","","","","","","","","","","","","","","","","","","","","","","","","","","","","","","","","","","","","","","","","","","","","","","","","","","","","","","","","","","","","","","","","","","","","","","","","","","","","","","","","","","","","","","","","","","","","","","","","","","","","","","","","","","","","","","","","","","","","","","","","","","","","","","","","","","","","","","","","","","","","","","","","","","","","","","","","","","","","",null,"","","","","","","","","","","","","","","","","","","","","","","","","","","","","","","","","","",""]
[null,7,4,null,null,null,null,null,null,null,null,null,null,null,null,null,null,null,null,null,null,null,null,null,null,null,null,null,null,null,null,null,null,null,null,null,null,null,null,"",7,"Lire à voix haute avec fluidité, après préparation, un texte d’une demi-page.",1,"","","","","","","","","","","","","","","","","","","","","","","","","","","","","","","","","","","","","","","","","","","","","","","","","","","","","","","","","","","","","","","","","","","","","","","","","","","","","","","","","","","","","","","","","","","","","","","","","","","","","","","","","","","","","","","","","","","","","","","","","","","","","","","","","","","","","","","","","","","","","","","","","","","","","","","","","","","","","","","","","","","","","","","","","","","","","","","","","","","","","","","","","","","","","","","","","","","","","","","","","",7,"Lire à voix haute avec fluidité, après préparation, un texte d’une demi-page.",1,"","","","","","","","","","","","","","","","","","","","","","","","","","","","","","","","","","","","","","","","","","","","","","","","","","","","","","","","","","","","","","","","","","","","","","","","","","","","","","","","","","","","","","","","","","","","","","","","","","","","","","","","","","","","","","","","","","","","","","","","","","","","","","","","","","","","","","","","","","","","","","","","","","","","","","","","","","","","","","","","","","","","","","","","","","","","","","","","","","","","","","","","","","","","","","","","","","","","","","","","","",7,"Lire à voix haute avec fluidité, après préparation, un texte d’une demi-page.",1,"","","","","","","","","","","","","","","","","","","","","","","","","","","","","","","","","","","","","","","","","","","","","","","","","","","","","","","","","","","","","","","","","","","","","","","","","","","","","","","","","","","","","","","","","","","","","","","","","","","","","","","","","","","","","","","","","","","","","","","","","","","","","","","","","","","","","","","","","","","","","","","","","","","","","","","","","","","","","","","","","","","","","","","","","","","","","","","","","","","","","","","","","","","","","","","","","","","","","","","","",null,null,null,null,null,null,null,null,null,null,null,null,null,null,null,null,null,null,null,null,null,null,null,null,null,null,null,null,null,null,null,null,null,null,null,{"$f":"IF(OR(ISBLANK(INDEX(liste_des_resultats,ROW()-1,CELL(\"contenu\",'Bilan - élève'!$J$1))),ISERROR(INDEX(liste_des_resultats,ROW()-1,CELL(\"contenu\",'Bilan - élève'!$J$1)))),\"\",INDEX(liste_des_resultats,ROW()-1,CELL(\"contenu\",'Bilan - élève'!$J$1)))","v":""},3,"","","","","","","","","","","","","","","","","","","","","","","","","","","","","","","","","","","",1,2,8,9,0,null,null,null,null,null,null,null,"","","","","","","","","","","","","","","","","","","","","","","","",3,"","","","","","","","","","","","","","","","","","","","","","","","","","","","","","","","","","","","","","","","","","","","","","","","","","","","","","","","","","","","","","","","","","","","","","","","","","","","","","","","","","","","","","","","","","","","","","","","","","","","","","","","","","","","","","","","","","","","","","","","","","","","","","","","","","","","","","","","","","","","","","","","","","","","","","","","","","","","","","","","","","","","","","","","","","","","","","","",null,"","","","","","","","","","","","","","","","","","","","","","","","","","","","","","","","","","",""]
[2,8,5,null,null,null,null,null,null,null,null,null,null,null,null,null,null,null,null,null,null,null,null,null,null,null,null,null,null,null,null,null,null,null,null,null,null,null,null,"",8,"Copier ou transcrire, dans une écriture lisible, un texte d’une dizaine de lignes.",2,"","","","","","","","","","","","","","","","","","","","","","","","","","","","","","","","","","","","","","","","","","","","","","","","","","","","","","","","","","","","","","","","","","","","","","","","","","","","","","","","","","","","","","","","","","","","","","","","","","","","","","","","","","","","","","","","","","","","","","","","","","","","","","","","","","","","","","","","","","","","","","","","","","","","","","","","","","","","","","","","","","","","","","","","","","","","","","","","","","","","","","","","","","","","","","","","","","","","","","","","","",8,"Copier ou transcrire, dans une écriture lisible, un texte d’une dizaine de lignes.",2,"","","","","","","","","","","","","","","","","","","","","","","","","","","","","","","","","","","","","","","","","","","","","","","","","","","","","","","","","","","","","","","","","","","","","","","","","","","","","","","","","","","","","","","","","","","","","","","","","","","","","","","","","","","","","","","","","","","","","","","","","","","","","","","","","","","","","","","","","","","","","","","","","","","","","","","","","","","","","","","","","","","","","","","","","","","","","","","","","","","","","","","","","","","","","","","","","","","","","","","","","",8,"Copier ou transcrire, dans une écriture lisible, un texte d’une dizaine de lignes.",2,"","","","","","","","","","","","","","","","","","","","","","","","","","","","","","","","","","","","","","","","","","","","","","","","","","","","","","","","","","","","","","","","","","","","","","","","","","","","","","","","","","","","","","","","","","","","","","","","","","","","","","","","","","","","","","","","","","","","","","","","","","","","","","","","","","","","","","","","","","","","","","","","","","","","","","","","","","","","","","","","","","","","","","","","","","","","","","","","","","","","","","","","","","","","","","","","","","","","","","","","",null,null,null,null,null,null,null,null,null,null,null,null,null,null,null,null,null,null,null,null,null,null,null,null,null,null,null,null,null,null,null,null,null,null,null,{"$f":"IF(OR(ISBLANK(INDEX(liste_des_resultats,ROW()-1,CELL(\"contenu\",'Bilan - élève'!$J$1))),ISERROR(INDEX(liste_des_resultats,ROW()-1,CELL(\"contenu\",'Bilan - élève'!$J$1)))),\"\",INDEX(liste_des_resultats,ROW()-1,CELL(\"contenu\",'Bilan - élève'!$J$1)))","v":""},3,"",{"$f":"IF(F26=1,3,IF(F26=2,2,IF(F26=8,1,IF(F26=9,0,IF(ISBLANK(F26),\"\",IF(F26=0,\"A\"))))))","v":""},{"$f":"IF(G26=1,3,IF(G26=2,2,IF(G26=8,1,IF(G26=9,0,IF(ISBLANK(G26),\"\",IF(G26=0,\"A\"))))))","v":""},{"$f":"IF(H26=1,3,IF(H26=2,2,IF(H26=8,1,IF(H26=9,0,IF(ISBLANK(H26),\"\",IF(H26=0,\"A\"))))))","v":""},{"$f":"IF(I26=1,3,IF(I26=2,2,IF(I26=8,1,IF(I26=9,0,IF(ISBLANK(I26),\"\",IF(I26=0,\"A\"))))))","v":""},{"$f":"IF(J26=1,3,IF(J26=2,2,IF(J26=8,1,IF(J26=9,0,IF(ISBLANK(J26),\"\",IF(J26=0,\"A\"))))))","v":""},{"$f":"IF(K26=1,3,IF(K26=2,2,IF(K26=8,1,IF(K26=9,0,IF(ISBLANK(K26),\"\",IF(K26=0,\"A\"))))))","v":""},{"$f":"IF(L26=1,3,IF(L26=2,2,IF(L26=8,1,IF(L26=9,0,IF(ISBLANK(L26),\"\",IF(L26=0,\"A\"))))))","v":""},{"$f":"IF(M26=1,3,IF(M26=2,2,IF(M26=8,1,IF(M26=9,0,IF(ISBLANK(M26),\"\",IF(M26=0,\"A\"))))))","v":""},{"$f":"IF(N26=1,3,IF(N26=2,2,IF(N26=8,1,IF(N26=9,0,IF(ISBLANK(N26),\"\",IF(N26=0,\"A\"))))))","v":""},{"$f":"IF(O26=1,3,IF(O26=2,2,IF(O26=8,1,IF(O26=9,0,IF(ISBLANK(O26),\"\",IF(O26=0,\"A\"))))))","v":""},{"$f":"IF(P26=1,3,IF(P26=2,2,IF(P26=8,1,IF(P26=9,0,IF(ISBLANK(P26),\"\",IF(P26=0,\"A\"))))))","v":""},{"$f":"IF(Q26=1,3,IF(Q26=2,2,IF(Q26=8,1,IF(Q26=9,0,IF(ISBLANK(Q26),\"\",IF(Q26=0,\"A\"))))))","v":""},{"$f":"IF(R26=1,3,IF(R26=2,2,IF(R26=8,1,IF(R26=9,0,IF(ISBLANK(R26),\"\",IF(R26=0,\"A\"))))))","v":""},{"$f":"IF(S26=1,3,IF(S26=2,2,IF(S26=8,1,IF(S26=9,0,IF(ISBLANK(S26),\"\",IF(S26=0,\"A\"))))))","v":""},{"$f":"IF(T26=1,3,IF(T26=2,2,IF(T26=8,1,IF(T26=9,0,IF(ISBLANK(T26),\"\",IF(T26=0,\"A\"))))))","v":""},{"$f":"IF(U26=1,3,IF(U26=2,2,IF(U26=8,1,IF(U26=9,0,IF(ISBLANK(U26),\"\",IF(U26=0,\"A\"))))))","v":""},{"$f":"IF(V26=1,3,IF(V26=2,2,IF(V26=8,1,IF(V26=9,0,IF(ISBLANK(V26),\"\",IF(V26=0,\"A\"))))))","v":""},{"$f":"IF(W26=1,3,IF(W26=2,2,IF(W26=8,1,IF(W26=9,0,IF(ISBLANK(W26),\"\",IF(W26=0,\"A\"))))))","v":""},{"$f":"IF(X26=1,3,IF(X26=2,2,IF(X26=8,1,IF(X26=9,0,IF(ISBLANK(X26),\"\",IF(X26=0,\"A\"))))))","v":""},{"$f":"IF(Y26=1,3,IF(Y26=2,2,IF(Y26=8,1,IF(Y26=9,0,IF(ISBLANK(Y26),\"\",IF(Y26=0,\"A\"))))))","v":""},{"$f":"IF(Z26=1,3,IF(Z26=2,2,IF(Z26=8,1,IF(Z26=9,0,IF(ISBLANK(Z26),\"\",IF(Z26=0,\"A\"))))))","v":""},{"$f":"IF(AA26=1,3,IF(AA26=2,2,IF(AA26=8,1,IF(AA26=9,0,IF(ISBLANK(AA26),\"\",IF(AA26=0,\"A\"))))))","v":""},{"$f":"IF(AB26=1,3,IF(AB26=2,2,IF(AB26=8,1,IF(AB26=9,0,IF(ISBLANK(AB26),\"\",IF(AB26=0,\"A\"))))))","v":""},{"$f":"IF(AC26=1,3,IF(AC26=2,2,IF(AC26=8,1,IF(AC26=9,0,IF(ISBLANK(AC26),\"\",IF(AC26=0,\"A\"))))))","v":""},{"$f":"IF(AD26=1,3,IF(AD26=2,2,IF(AD26=8,1,IF(AD26=9,0,IF(ISBLANK(AD26),\"\",IF(AD26=0,\"A\"))))))","v":""},{"$f":"IF(AE26=1,3,IF(AE26=2,2,IF(AE26=8,1,IF(AE26=9,0,IF(ISBLANK(AE26),\"\",IF(AE26=0,\"A\"))))))","v":""},{"$f":"IF(AF26=1,3,IF(AF26=2,2,IF(AF26=8,1,IF(AF26=9,0,IF(ISBLANK(AF26),\"\",IF(AF26=0,\"A\"))))))","v":""},{"$f":"IF(AG26=1,3,IF(AG26=2,2,IF(AG26=8,1,IF(AG26=9,0,IF(ISBLANK(AG26),\"\",IF(AG26=0,\"A\"))))))","v":""},{"$f":"IF(AH26=1,3,IF(AH26=2,2,IF(AH26=8,1,IF(AH26=9,0,IF(ISBLANK(AH26),\"\",IF(AH26=0,\"A\"))))))","v":""},{"$f":"IF(AI26=1,3,IF(AI26=2,2,IF(AI26=8,1,IF(AI26=9,0,IF(ISBLANK(AI26),\"\",IF(AI26=0,\"A\"))))))","v":""},{"$f":"IF(AJ26=1,3,IF(AJ26=2,2,IF(AJ26=8,1,IF(AJ26=9,0,IF(ISBLANK(AJ26),\"\",IF(AJ26=0,\"A\"))))))","v":""},{"$f":"IF(AK26=1,3,IF(AK26=2,2,IF(AK26=8,1,IF(AK26=9,0,IF(ISBLANK(AK26),\"\",IF(AK26=0,\"A\"))))))","v":""},{"$f":"IF(AL26=1,3,IF(AL26=2,2,IF(AL26=8,1,IF(AL26=9,0,IF(ISBLANK(AL26),\"\",IF(AL26=0,\"A\"))))))","v":""},{"$f":"IF(AM26=1,3,IF(AM26=2,2,IF(AM26=8,1,IF(AM26=9,0,IF(ISBLANK(AM26),\"\",IF(AM26=0,\"A\"))))))","v":""},1,2,8,9,0,null,null,null,null,null,null,null,"","","","","","","","","","","","","","","","","","","","","","","","","","","","","",3,"","","","","","","","","","","","","","","","","","","","","","","","","","","","","","","","","","","","","","","","","","","","","","","","","","","","","","","","","","","","","","","","","","","","","","","","","","","","","","","","","","","","","","","","","","","","","","","","","","","","","","","","","","","","","","","","","","","","","","","","","","","","","","","","","","","","","","","","","","","","","","","","","","","","","","","","","","","","","","","","","","","","","","","","","","",null,"","","","","","","","","","","","","","","","","","","","","","","","","","","","","","","","","","",""]
[null,9,6,null,null,null,null,null,null,null,null,null,null,null,null,null,null,null,null,null,null,null,null,null,null,null,null,null,null,null,null,null,null,null,null,null,null,null,null,"",9,"Rédiger un texte d’environ une demi-page, cohérent, organisé, ponctué, pertinent.",2,"","","","","","","","","","","","","","","","","","","","","","","","","","","","","","","","","","","","","","","","","","","","","","","","","","","","","","","","","","","","","","","","","","","","","","","","","","","","","","","","","","","","","","","","","","","","","","","","","","","","","","","","","","","","","","","","","","","","","","","","","","","","","","","","","","","","","","","","","","","","","","","","","","","","","","","","","","","","","","","","","","","","","","","","","","","","","","","","","","","","","","","","","","","","","","","","","","","","","","","","","",9,"Rédiger un texte d’environ une demi-page, cohérent, organisé, ponctué, pertinent.",2,"","","","","","","","","","","","","","","","","","","","","","","","","","","","","","","","","","","","","","","","","","","","","","","","","","","","","","","","","","","","","","","","","","","","","","","","","","","","","","","","","","","","","","","","","","","","","","","","","","","","","","","","","","","","","","","","","","","","","","","","","","","","","","","","","","","","","","","","","","","","","","","","","","","","","","","","","","","","","","","","","","","","","","","","","","","","","","","","","","","","","","","","","","","","","","","","","","","","","","","","","",9,"Rédiger un texte d’environ une demi-page, cohérent, organisé, ponctué, pertinent.",2,"","","","","","","","","","","","","","","","","","","","","","","","","","","","","","","","","","","","","","","","","","","","","","","","","","","","","","","","","","","","","","","","","","","","","","","","","","","","","","","","","","","","","","","","","","","","","","","","","","","","","","","","","","","","","","","","","","","","","","","","","","","","","","","","","","","","","","","","","","","","","","","","","","","","","","","","","","","","","","","","","","","","","","","","","","","","","","","","","","","","","","","","","","","","","","","","","","","","","","","","",null,null,null,null,null,null,null,null,null,null,null,null,null,null,null,null,null,null,null,null,null,null,null,null,null,null,null,null,null,null,null,null,null,null,null,{"$f":"IF(OR(ISBLANK(INDEX(liste_des_resultats,ROW()-1,CELL(\"contenu\",'Bilan - élève'!$J$1))),ISERROR(INDEX(liste_des_resultats,ROW()-1,CELL(\"contenu\",'Bilan - élève'!$J$1)))),\"\",INDEX(liste_des_resultats,ROW()-1,CELL(\"contenu\",'Bilan - élève'!$J$1)))","v":""},3,"","","","","","","","","","","","","","","","","","","","","","","","","","","","","","","","","","","",1,2,8,9,0,null,null,null,null,null,null,null,"","","","","","","","","","","","","","","","","","","","","","","","","","","","","","","","","",3,"","","","","","","","","","","","","","","","","","","","","","","","","","","","","","","","","","","","","","","","","","","","","","","","","","","","","","","","","","","","","","","","","","","","","","","","","","","","","","","","","","","","","","","","","","","","","","","","","","","","","","","","","","","","","","","","","","","","","","","","","","","","","","","","","","","","","","","","","","","","","","","","","","","","","","","","","","","","","","","","","","","","","","",null,"","","","","","","","","","","","","","","","","","","","","","","","","","","","","","","","","","",""]
[3,11,7,null,null,null,null,null,null,null,null,null,null,null,null,null,null,null,null,null,null,null,null,null,null,null,null,null,null,null,null,null,null,null,null,null,null,null,null,"",11,"Orthographier les mots les plus fréquents et les mots invariables mémorisés.",4,"","","","","","","","","","","","","","","","","","","","","","","","","","","","","","","","","","","","","","","","","","","","","","","","","","","","","","","","","","","","","","","","","","","","","","","","","","","","","","","","","","","","","","","","","","","","","","","","","","","","","","","","","","","","","","","","","","","","","","","","","","","","","","","","","","","","","","","","","","","","","","","","","","","","","","","","","","","","","","","","","","","","","","","","","","","","","","","","","","","","","","","","","","","","","","","","","","","","","","","","","",11,"Orthographier les mots les plus fréquents et les mots invariables mémorisés.",4,"","","","","","","","","","","","","","","","","","","","","","","","","","","","","","","","","","","","","","","","","","","","","","","","","","","","","","","","","","","","","","","","","","","","","","","","","","","","","","","","","","","","","","","","","","","","","","","","","","","","","","","","","","","","","","","","","","","","","","","","","","","","","","","","","","","","","","","","","","","","","","","","","","","","","","","","","","","","","","","","","","","","","","","","","","","","","","","","","","","","","","","","","","","","","","","","","","","","","","","","","",11,"Orthographier les mots les plus fréquents et les mots invariables mémorisés.",4,"","","","","","","","","","","","","","","","","","","","","","","","","","","","","","","","","","","","","","","","","","","","","","","","","","","","","","","","","","","","","","","","","","","","","","","","","","","","","","","","","","","","","","","","","","","","","","","","","","","","","","","","","","","","","","","","","","","","","","","","","","","","","","","","","","","","","","","","","","","","","","","","","","","","","","","","","","","","","","","","","","","","","","","","","","","","","","","","","","","","","","","","","","","","","","","","","","","","","","","","",null,null,null,null,null,null,null,null,null,null,null,null,null,null,null,null,null,null,null,null,null,null,null,null,null,null,null,null,null,null,null,null,null,null,null,{"$f":"IF(OR(ISBLANK(INDEX(liste_des_resultats,ROW()-1,CELL(\"contenu\",'Bilan - élève'!$J$1))),ISERROR(INDEX(liste_des_resultats,ROW()-1,CELL(\"contenu\",'Bilan - élève'!$J$1)))),\"\",INDEX(liste_des_resultats,ROW()-1,CELL(\"contenu\",'Bilan - élève'!$J$1)))","v":""},3,"","","","","","","","","","","","","","","","","","","","","","","","","","","","","","","","","","","",1,2,9,0,null,null,null,null,null,null,null,null,"","","","","","","","","","","","","","","","","","","","","","","","","","","","","","","","","","","","","","","","","","","",3,"","","","","","","","","","","","","","","","","","","","","","","","","","","","","","","","","","","","","","","","","","","","","","","","","","","","","","","","","","","","","","","","","","","","","","","","","","","","","","","","","","","","","","","","","","","","","","","","","","","","","","","","","","","","","","","","","","","","","","","","","","","","","","","","","","","","","","","","","","","","","","","","","","","","","","","","","","","","",null,"","","","","","","","","","","","","","","","","","","","","","","","","","","","","","","","","","",""]
[null,12,8,null,null,null,null,null,null,null,null,null,null,null,null,null,null,null,null,null,null,null,null,null,null,null,null,null,null,null,null,null,null,null,null,null,null,null,null,"",12,"Raisonner pour réaliser les accords dans le groupe nominal et entre le verbe et son sujet.",2,"","","","","","","","","","","","","","","","","","","","","","","","","","","","","","","","","","","","","","","","","","","","","","","","","","","","","","","","","","","","","","","","","","","","","","","","","","","","","","","","","","","","","","","","","","","","","","","","","","","","","","","","","","","","","","","","","","","","","","","","","","","","","","","","","","","","","","","","","","","","","","","","","","","","","","","","","","","","","","","","","","","","","","","","","","","","","","","","","","","","","","","","","","","","","","","","","","","","","","","","","",12,"Raisonner pour réaliser les accords dans le groupe nominal et entre le verbe et son sujet.",2,"","","","","","","","","","","","","","","","","","","","","","","","","","","","","","","","","","","","","","","","","","","","","","","","","","","","","","","","","","","","","","","","","","","","","","","","","","","","","","","","","","","","","","","","","","","","","","","","","","","","","","","","","","","","","","","","","","","","","","","","","","","","","","","","","","","","","","","","","","","","","","","","","","","","","","","","","","","","","","","","","","","","","","","","","","","","","","","","","","","","","","","","","","","","","","","","","","","","","","","","","",12,"Raisonner pour réaliser les accords dans le groupe nominal et entre le verbe et son sujet.",2,"","","","","","","","","","","","","","","","","","","","","","","","","","","","","","","","","","","","","","","","","","","","","","","","","","","","","","","","","","","","","","","","","","","","","","","","","","","","","","","","","","","","","","","","","","","","","","","","","","","","","","","","","","","","","","","","","","","","","","","","","","","","","","","","","","","","","","","","","","","","","","","","","","","","","","","","","","","","","","","","","","","","","","","","","","","","","","","","","","","","","","","","","","","","","","","","","","","","","","","","",null,null,null,null,null,null,null,null,null,null,null,null,null,null,null,null,null,null,null,null,null,null,null,null,null,null,null,null,null,null,null,null,null,null,null,{"$f":"IF(OR(ISBLANK(INDEX(liste_des_resultats,ROW()-1,CELL(\"contenu\",'Bilan - élève'!$J$1))),ISERROR(INDEX(liste_des_resultats,ROW()-1,CELL(\"contenu\",'Bilan - élève'!$J$1)))),\"\",INDEX(liste_des_resultats,ROW()-1,CELL(\"contenu\",'Bilan - élève'!$J$1)))","v":""},3,"","","","","","","","","","","","","","","","","","","","","","","","","","","","","","","","","","","",1,9,0,null,null,null,null,null,null,null,null,null,"","","","","","","","","","","","","","","","","","","","","","","","","","","","","","","","","","","","","","","","","","","","","",3,"","","","","","","","","","","","","","","","","","","","","","","","","","","","","","","","","","","","","","","","","","","","","","","","","","","","","","","","","","","","","","","","","","","","","","","","","","","","","","","","","","","","","","","","","","","","","","","","","","","","","","","","","","","","","","","","","","","","","","","","","","","","","","","","","","","","","","","","","","","","","","","","","","","","","","","","","","",null,"","","","","","","","","","","","","","","","","","","","","","","","","","","","","","","","","","",""]
[null,12,9,null,null,null,null,null,null,null,null,null,null,null,null,null,null,null,null,null,null,null,null,null,null,null,null,null,null,null,null,null,null,null,null,null,null,null,null,"",12,"Raisonner pour réaliser les accords dans le groupe nominal et entre le verbe et son sujet.",2,"","","","","","","","","","","","","","","","","","","","","","","","","","","","","","","","","","","","","","","","","","","","","","","","","","","","","","","","","","","","","","","","","","","","","","","","","","","","","","","","","","","","","","","","","","","","","","","","","","","","","","","","","","","","","","","","","","","","","","","","","","","","","","","","","","","","","","","","","","","","","","","","","","","","","","","","","","","","","","","","","","","","","","","","","","","","","","","","","","","","","","","","","","","","","","","","","","","","","","","","","",12,"Raisonner pour réaliser les accords dans le groupe nominal et entre le verbe et son sujet.",2,"","","","","","","","","","","","","","","","","","","","","","","","","","","","","","","","","","","","","","","","","","","","","","","","","","","","","","","","","","","","","","","","","","","","","","","","","","","","","","","","","","","","","","","","","","","","","","","","","","","","","","","","","","","","","","","","","","","","","","","","","","","","","","","","","","","","","","","","","","","","","","","","","","","","","","","","","","","","","","","","","","","","","","","","","","","","","","","","","","","","","","","","","","","","","","","","","","","","","","","","","",12,"Raisonner pour réaliser les accords dans le groupe nominal et entre le verbe et son sujet.",2,"","","","","","","","","","","","","","","","","","","","","","","","","","","","","","","","","","","","","","","","","","","","","","","","","","","","","","","","","","","","","","","","","","","","","","","","","","","","","","","","","","","","","","","","","","","","","","","","","","","","","","","","","","","","","","","","","","","","","","","","","","","","","","","","","","","","","","","","","","","","","","","","","","","","","","","","","","","","","","","","","","","","","","","","","","","","","","","","","","","","","","","","","","","","","","","","","","","","","","","","",null,null,null,null,null,null,null,null,null,null,null,null,null,null,null,null,null,null,null,null,null,null,null,null,null,null,null,null,null,null,null,null,null,null,null,{"$f":"IF(OR(ISBLANK(INDEX(liste_des_resultats,ROW()-1,CELL(\"contenu\",'Bilan - élève'!$J$1))),ISERROR(INDEX(liste_des_resultats,ROW()-1,CELL(\"contenu\",'Bilan - élève'!$J$1)))),\"\",INDEX(liste_des_resultats,ROW()-1,CELL(\"contenu\",'Bilan - élève'!$J$1)))","v":""},3,"","","","","","","","","","","","","","","","","","","","","","","","","","","","","","","","","","","",1,2,8,9,0,null,null,null,null,null,null,null,"","","","","","","","","","","","","","","","","","","","","","","","","","","","","","","","","","","","","","","","","","","","","",3,"","","","","","","","","","","","","","","","","","","","","","","","","","","","","","","","","","","","","","","","","","","","","","","","","","","","","","","","","","","","","","","","","","","","","","","","","","","","","","","","","","","","","","","","","","","","","","","","","","","","","","","","","","","","","","","","","","","","","","","","","","","","","","","","","","","","","","","","","","","","","","","","","","","","","","","","","","",null,"","","","","","","","","","","","","","","","","","","","","","","","","","","","","","","","","","",""]
[4,3,10,null,null,null,null,null,null,null,null,null,null,null,null,null,null,null,null,null,null,null,null,null,null,null,null,null,null,null,null,null,null,null,null,null,null,null,null,"",3,"Pratiquer avec efficacité les formes de discours attendues - notamment raconter, décrire, expliquer.",1,"","","","","","","","","","","","","","","","","","","","","","","","","","","","","","","","","","","","","","","","","","","","","","","","","","","","","","","","","","","","","","","","","","","","","","","","","","","","","","","","","","","","","","","","","","","","","","","","","","","","","","","","","","","","","","","","","","","","","","","","","","","","","","","","","","","","","","","","","","","","","","","","","","","","","","","","","","","","","","","","","","","","","","","","","","","","","","","","","","","","","","","","","","","","","","","","","","","","","","","","","",3,"Pratiquer avec efficacité les formes de discours attendues - notamment raconter, décrire, expliquer.",1,"","","","","","","","","","","","","","","","","","","","","","","","","","","","","","","","","","","","","","","","","","","","","","","","","","","","","","","","","","","","","","","","","","","","","","","","","","","","","","","","","","","","","","","","","","","","","","","","","","","","","","","","","","","","","","","","","","","","","","","","","","","","","","","","","","","","","","","","","","","","","","","","","","","","","","","","","","","","","","","","","","","","","","","","","","","","","","","","","","","","","","","","","","","","","","","","","","","","","","","","","",3,"Pratiquer avec efficacité les formes de discours attendues - notamment raconter, décrire, expliquer.",1,"","","","","","","","","","","","","","","","","","","","","","","","","","","","","","","","","","","","","","","","","","","","","","","","","","","","","","","","","","","","","","","","","","","","","","","","","","","","","","","","","","","","","","","","","","","","","","","","","","","","","","","","","","","","","","","","","","","","","","","","","","","","","","","","","","","","","","","","","","","","","","","","","","","","","","","","","","","","","","","","","","","","","","","","","","","","","","","","","","","","","","","","","","","","","","","","","","","","","","","","",null,null,null,null,null,null,null,null,null,null,null,null,null,null,null,null,null,null,null,null,null,null,null,null,null,null,null,null,null,null,null,null,null,null,null,{"$f":"IF(OR(ISBLANK(INDEX(liste_des_resultats,ROW()-1,CELL(\"contenu\",'Bilan - élève'!$J$1))),ISERROR(INDEX(liste_des_resultats,ROW()-1,CELL(\"contenu\",'Bilan - élève'!$J$1)))),\"\",INDEX(liste_des_resultats,ROW()-1,CELL(\"contenu\",'Bilan - élève'!$J$1)))","v":""},3,"","","","","","","","","","","","","","","","","","","","","","","","","","","","","","","","","","","",1,2,8,9,0,null,null,null,null,null,null,null,"","","","","","","","",3,"","","","","","","","","","","","","","","","","","","","","","","","","","","","","","","","","","","","","","","","","","","","","","","","","","","","","","","","","","","","","","","","","","","","","","","","","","","","","","","","","","","","","","","","","","","","","","","","","","","","","","","","","","","","","","","","","","","","","","","","","","","","","","","","","","","","","","","","","","","","","","","","","","","","","","","","","","","","","","","","","","","","","","","","","","","","","","","","","","","","","","","","","","","","","","","",null,"","","","","","","","","","","","","","","","","","","","","","","","","","","","","","","","","","",""]
[null,null,null,"Total MS1",{"$f":"COUNT(E2:E4)+COUNTIF(E2:E4,\"A\")","v":0},0,0,0,0,0,0,0,0,0,0,0,0,0,0,0,0,0,0,0,0,0,0,0,0,0,0,0,0,0,0,0,0,0,0,{"$f":"COUNT(AN2:AN4)","v":0},null,"Niveau :",null,{"$f":"MOD(COLUMN()-44,4)+1","v":1},{"$f":"MOD(COLUMN()-44,4)+1","v":2},3,4,1,2,3,4,1,2,3,4,1,2,3,4,1,2,3,4,1,2,3,4,1,2,3,4,1,2,3,4,1,2,3,4,1,2,3,4,1,2,3,4,1,2,3,4,1,2,3,4,1,2,3,4,1,2,3,4,1,2,3,4,1,{"$f":"MOD(COLUMN()-44,4)+1","v":2},3,4,1,2,3,4,1,2,3,4,1,2,3,4,1,2,3,4,1,2,3,4,1,2,3,4,1,2,3,4,1,2,3,4,1,2,3,4,1,2,3,4,1,2,3,4,1,2,3,4,1,2,3,4,1,2,3,4,1,2,3,4,1,{"$f":"MOD(COLUMN()-44,4)+1","v":2},3,4,1,2,3,4,1,2,3,4,1,2,3,4,1,2,3,4,1,2,3,4,1,2,3,4,1,2,3,4,1,2,3,4,1,2,3,4,1,2,3,4,1,2,3,4,1,2,3,4,1,2,3,4,1,2,3,4,1,2,3,4,1,{"$f":"MOD(COLUMN()-44,4)+1","v":2},3,4,1,2,3,4,null,null,"Niveau :",null,{"$f":"MOD(COLUMN()-44,4)+1","v":1},{"$f":"MOD(COLUMN()-44,4)+1","v":2},3,4,1,2,3,4,1,2,3,4,1,2,3,4,1,2,3,4,1,2,3,4,1,2,3,4,1,2,3,4,1,2,3,4,1,2,3,4,1,2,3,4,1,2,3,4,1,2,3,4,1,2,3,4,1,2,3,4,1,2,3,4,1,{"$f":"MOD(COLUMN()-44,4)+1","v":2},3,4,1,2,3,4,1,2,3,4,1,2,3,4,1,2,3,4,1,2,3,4,1,2,3,4,1,2,3,4,1,2,3,4,1,2,3,4,1,2,3,4,1,2,3,4,1,2,3,4,1,2,3,4,1,2,3,4,1,2,3,4,1,{"$f":"MOD(COLUMN()-44,4)+1","v":2},3,4,1,2,3,4,1,2,3,4,1,2,3,4,1,2,3,4,1,2,3,4,1,2,3,4,1,2,3,4,1,2,3,4,1,2,3,4,1,2,3,4,1,2,3,4,1,2,3,4,1,2,3,4,1,2,3,4,1,2,3,4,1,{"$f":"MOD(COLUMN()-44,4)+1","v":2},3,4,1,2,3,4,null,null,"Niveau :",null,{"$f":"MOD(COLUMN()-44,4)+1","v":1},{"$f":"MOD(COLUMN()-44,4)+1","v":2},3,4,1,2,3,4,1,2,3,4,1,2,3,4,1,2,3,4,1,2,3,4,1,2,3,4,1,2,3,4,1,2,3,4,1,2,3,4,1,2,3,4,1,2,3,4,1,2,3,4,1,2,3,4,1,2,3,4,1,2,3,4,1,{"$f":"MOD(COLUMN()-44,4)+1","v":2},3,4,1,2,3,4,1,2,3,4,1,2,3,4,1,2,3,4,1,2,3,4,1,2,3,4,1,2,3,4,1,2,3,4,1,2,3,4,1,2,3,4,1,2,3,4,1,2,3,4,1,2,3,4,1,2,3,4,1,2,3,4,1,{"$f":"MOD(COLUMN()-44,4)+1","v":2},3,4,1,2,3,4,1,2,3,4,1,2,3,4,1,2,3,4,1,2,3,4,1,2,3,4,1,2,3,4,1,2,3,4,1,2,3,4,1,2,3,4,1,2,3,4,1,2,3,4,1,2,3,4,1,2,3,4,1,2,3,4,1,{"$f":"MOD(COLUMN()-44,4)+1","v":2},3,4,1,2,3,4,null,null,null,null,null,null,null,null,null,null,null,null,null,null,null,null,null,null,null,null,null,null,null,null,null,null,null,null,null,null,null,null,null,null,null,null,null,{"$f":"COUNT(ZM2:ZM13)+COUNTIF(ZM2:ZM13,\"A\")","v":0},{"$f":"COUNT(ZN2:ZN13)+COUNTIF(ZN2:ZN13,\"A\")","v":0},0,0,0,0,0,0,0,0,0,0,0,0,0,0,0,0,0,0,0,0,0,0,0,0,0,0,0,0,0,0,0,0,0,null,null,null,null,null,null,null,null,null,null,null,null,{"$f":"MOD(COLUMN()-44,4)+1","v":1},{"$f":"MOD(COLUMN()-44,4)+1","v":2},3,4,1,2,3,4,1,2,3,4,1,2,3,4,1,2,3,4,1,2,3,4,1,2,3,4,1,2,3,4,1,2,3,4,1,2,3,4,1,2,3,4,1,2,3,4,1,2,3,4,1,2,3,4,1,2,3,4,1,2,3,4,1,{"$f":"MOD(COLUMN()-44,4)+1","v":2},3,4,1,2,3,4,1,2,3,4,1,2,3,4,1,2,3,4,1,2,3,4,1,2,3,4,1,2,3,4,1,2,3,4,1,2,3,4,1,2,3,4,1,2,3,4,1,2,3,4,1,2,3,4,1,2,3,4,1,2,3,4,1,{"$f":"MOD(COLUMN()-44,4)+1","v":2},3,4,1,2,3,4,1,2,3,4,1,2,3,4,1,2,3,4,1,2,3,4,1,2,3,4,1,2,3,4,1,2,3,4,1,2,3,4,1,2,3,4,1,2,3,4,1,2,3,4,1,2,3,4,1,2,3,4,1,2,3,4,1,{"$f":"MOD(COLUMN()-44,4)+1","v":2},3,4,1,2,3,4,null,{"$f":"COUNT(AJA2:AJA13)","v":0},{"$f":"COUNT(AJB2:AJB13)","v":0},0,0,0,0,0,0,0,0,0,0,0,0,0,0,0,0,0,0,0,0,0,0,0,0,0,0,0,0,0,0,0,0,0]
[null,null,null,"Total MS2",{"$f":"COUNT(E5:E9)+COUNTIF(E5:E9,\"A\")","v":0},0,0,0,0,0,0,0,0,0,0,0,0,0,0,0,0,0,0,0,0,0,0,0,0,0,0,0,0,0,0,0,0,0,0,{"$f":"COUNT(AN5:AN9)","v":0},null,"Total des points de l'élève",null,{"$f":"SUM(AR2:AR31)","v":0},0,0,0,0,0,0,0,0,0,0,0,0,0,0,0,0,0,0,0,0,0,0,0,0,0,0,0,0,0,0,0,{"$f":"SUM(BX2:BX31)","v":0},0,0,0,0,0,0,0,0,0,0,0,0,0,0,0,0,0,0,0,0,0,0,0,0,0,0,0,0,0,0,0,{"$f":"SUM(DD2:DD31)","v":0},0,0,0,0,0,0,0,0,0,0,0,0,0,0,0,0,0,0,0,0,0,0,0,0,0,0,0,0,0,0,0,{"$f":"SUM(EJ2:EJ31)","v":0},0,0,0,0,0,0,0,0,0,0,0,0,0,0,0,0,0,0,0,0,0,0,0,0,0,0,0,0,0,0,0,{"$f":"SUM(FP2:FP31)","v":0},0,0,0,0,0,0,0,0,0,0,0,0,0,0,0,0,0,0,0,0,0,0,0,0,0,0,0,0,0,0,0,{"$f":"SUM(GV2:GV31)","v":0},0,0,0,0,0,0,0,0,0,0,0,0,0,0,0,0,0,0,0,0,0,0,0,0,0,0,0,0,0,0,0,{"$f":"SUM(IB2:IB31)","v":0},0,0,0,0,0,0,0,null,null,"Total des points de l'élève",null,{"$f":"SUM(IN2:IN31)","v":0},0,0,0,0,0,0,0,0,0,0,0,0,0,0,0,0,0,0,0,0,0,0,0,0,0,0,0,0,0,0,0,{"$f":"SUM(JT2:JT31)","v":0},0,0,0,0,0,0,0,0,0,0,0,0,0,0,0,0,0,0,0,0,0,0,0,0,0,0,0,0,0,0,0,{"$f":"SUM(KZ2:KZ31)","v":0},0,0,0,0,0,0,0,0,0,0,0,0,0,0,0,0,0,0,0,0,0,0,0,0,0,0,0,0,0,0,0,{"$f":"SUM(MF2:MF31)","v":0},0,0,0,0,0,0,0,0,0,0,0,0,0,0,0,0,0,0,0,0,0,0,0,0,0,0,0,0,0,0,0,{"$f":"SUM(NL2:NL31)","v":0},0,0,0,0,0,0,0,0,0,0,0,0,0,0,0,0,0,0,0,0,0,0,0,0,0,0,0,0,0,0,0,{"$f":"SUM(OR2:OR31)","v":0},0,0,0,0,0,0,0,0,0,0,0,0,0,0,0,0,0,0,0,0,0,0,0,0,0,0,0,0,0,0,0,{"$f":"SUM(PX2:PX31)","v":0},0,0,0,0,0,0,0,null,null,null,null,null,null,null,null,null,null,null,null,null,null,null,null,null,null,null,null,null,null,null,null,null,null,null,null,null,null,null,null,null,null,null,null,null,null,null,null,null,null,null,null,null,null,null,null,null,null,null,null,null,null,null,null,null,null,null,null,null,null,null,null,null,null,null,null,null,null,null,null,null,null,null,null,null,null,null,null,null,null,null,null,null,null,null,null,null,null,null,null,null,null,null,null,null,null,null,null,null,null,null,null,null,null,null,null,null,null,null,null,null,null,null,null,null,null,null,null,null,null,null,null,null,null,null,null,null,null,null,null,null,null,null,null,null,null,null,null,null,null,null,null,null,null,null,null,null,null,null,null,null,null,null,null,null,null,null,null,null,null,null,null,null,null,null,null,null,null,null,null,null,null,null,null,null,null,null,null,null,null,null,null,null,null,null,null,null,null,null,null,null,null,null,null,null,null,null,null,null,null,null,null,null,null,null,null,null,null,null,null,null,null,null,null,null,null,null,null,null,null,null,null,null,null,null,null,null,null,null,null,null,null,null,null,null,null,null,null,null,{"$f":"COUNT(ZM14:ZM31)+COUNTIF(ZM14:ZM31,\"A\")","v":0},{"$f":"COUNT(ZN14:ZN31)+COUNTIF(ZN14:ZN31,\"A\")","v":0},0,0,0,0,0,0,0,0,0,0,0,0,0,0,0,0,0,0,0,0,0,0,0,0,0,0,0,0,0,0,0,0,0,null,null,null,null,null,null,null,null,null,null,null,"Total des points dans l'évaluation",{"$f":"SUM(ABH2:ABH31)","v":0},0,0,0,0,0,0,0,3,0,0,0,0,0,0,0,3,0,0,0,15,15,0,0,3,0,0,0,0,3,0,0,{"$f":"SUM(ACN2:ACN31)","v":0},3,0,0,0,0,0,0,0,0,0,3,0,6,0,0,0,0,0,0,3,3,0,0,3,0,0,0,0,9,3,0,{"$f":"SUM(ADT2:ADT31)","v":0},3,0,0,0,0,0,0,0,0,0,0,6,0,0,0,3,0,0,0,0,0,0,0,0,3,0,0,0,0,0,0,{"$f":"SUM(AEZ2:AEZ31)","v":0},0,0,0,0,0,0,0,0,0,0,0,0,0,0,0,0,0,0,0,0,0,0,0,0,0,0,0,0,0,0,0,{"$f":"SUM(AGF2:AGF31)","v":0},0,0,0,0,0,0,0,0,0,0,0,0,0,0,0,0,0,0,0,0,0,0,0,0,0,0,0,0,0,0,0,{"$f":"SUM(AHL2:AHL31)","v":0},0,0,0,0,0,0,0,0,0,0,0,0,0,0,0,0,0,0,0,0,0,0,0,0,0,0,0,0,0,0,0,{"$f":"SUM(AIR2:AIR31)","v":0},0,0,0,0,0,0,0,null,{"$f":"COUNT(AJA14:AJA31)","v":0},{"$f":"COUNT(AJB14:AJB31)","v":0},0,0,0,0,0,0,0,0,0,0,0,0,0,0,0,0,0,0,0,0,0,0,0,0,0,0,0,0,0,0,0,0,0]
[null,null,null,"Total MS3",{"$f":"COUNT(E10:E11)+COUNTIF(E10:E11,\"A\")","v":0},0,0,0,0,0,0,0,0,0,0,0,0,0,0,0,0,0,0,0,0,0,0,0,0,0,0,0,0,0,0,0,0,0,0,{"$f":"COUNT(AN10:AN11)","v":0},null,"Total des points possibles si l'élève est évalué",null,{"$f":"(COUNT(AR2:AR31)+COUNTIF(AR2:AR31,\"A\"))*3","v":0},{"$f":"(COUNT(AS2:AS31)+COUNTIF(AS2:AS31,\"A\"))*3","v":0},0,0,0,0,0,0,0,0,0,0,0,0,0,0,0,0,0,0,0,0,0,0,0,0,0,0,0,0,0,0,0,0,0,0,0,0,0,0,0,0,0,0,0,0,0,0,0,0,0,0,0,0,0,0,0,0,0,0,0,0,0,0,0,{"$f":"(COUNT(DE2:DE31)+COUNTIF(DE2:DE31,\"A\"))*3","v":0},0,0,0,0,0,0,0,0,0,0,0,0,0,0,0,0,0,0,0,0,0,0,0,0,0,0,0,0,0,0,0,0,0,0,0,0,0,0,0,0,0,0,0,0,0,0,0,0,0,0,0,0,0,0,0,0,0,0,0,0,0,0,0,{"$f":"(COUNT(FQ2:FQ31)+COUNTIF(FQ2:FQ31,\"A\"))*3","v":0},0,0,0,0,0,0,0,0,0,0,0,0,0,0,0,0,0,0,0,0,0,0,0,0,0,0,0,0,0,0,0,0,0,0,0,0,0,0,0,0,0,0,0,0,0,0,0,0,0,0,0,0,0,0,0,0,0,0,0,0,0,0,0,{"$f":"(COUNT(IC2:IC31)+COUNTIF(IC2:IC31,\"A\"))*3","v":0},0,0,0,0,0,0,null,null,"Total des points possibles",null,{"$f":"COUNT(IN2:IN31)*3","v":0},{"$f":"COUNT(IO2:IO31)*3","v":0},0,0,0,0,0,0,0,0,0,0,0,0,0,0,0,0,0,0,0,0,0,0,0,0,0,0,0,0,0,0,0,0,0,0,0,0,0,0,0,0,0,0,0,0,0,0,0,0,0,0,0,0,0,0,0,0,0,0,0,0,0,0,0,{"$f":"COUNT(LA2:LA31)*3","v":0},0,0,0,0,0,0,0,0,0,0,0,0,0,0,0,0,0,0,0,0,0,0,0,0,0,0,0,0,0,0,0,0,0,0,0,0,0,0,0,0,0,0,0,0,0,0,0,0,0,0,0,0,0,0,0,0,0,0,0,0,0,0,0,{"$f":"COUNT(NM2:NM31)*3","v":0},0,0,0,0,0,0,0,0,0,0,0,0,0,0,0,0,0,0,0,0,0,0,0,0,0,0,0,0,0,0,0,0,0,0,0,0,0,0,0,0,0,0,0,0,0,0,0,0,0,0,0,0,0,0,0,0,0,0,0,0,0,0,0,{"$f":"COUNT(PY2:PY31)*3","v":0},0,0,0,0,0,0,null,null,"Total des points possibles",null,{"$f":"COUNT(QJ2:QJ31)","v":0},0,0,0,0,0,0,0,0,0,0,0,0,0,0,0,0,0,0,0,0,0,0,0,0,0,0,0,0,0,0,0,{"$f":"COUNT(RP2:RP31)","v":0},0,0,0,0,0,0,0,0,0,0,0,0,0,0,0,0,0,0,0,0,0,0,0,0,0,0,0,0,0,0,0,{"$f":"COUNT(SV2:SV31)","v":0},0,0,0,0,0,0,0,0,0,0,0,0,0,0,0,0,0,0,0,0,0,0,0,0,0,0,0,0,0,0,0,{"$f":"COUNT(UB2:UB31)","v":0},0,0,0,0,0,0,0,0,0,0,0,0,0,0,0,0,0,0,0,0,0,0,0,0,0,0,0,0,0,0,0,{"$f":"COUNT(VH2:VH31)","v":0},0,0,0,0,0,0,0,0,0,0,0,0,0,0,0,0,0,0,0,0,0,0,0,0,0,0,0,0,0,0,0,{"$f":"COUNT(WN2:WN31)","v":0},0,0,0,0,0,0,0,0,0,0,0,0,0,0,0,0,0,0,0,0,0,0,0,0,0,0,0,0,0,0,0,{"$f":"COUNT(XT2:XT31)","v":0},0,0,0,0,0,0,0]
[null,null,null,"Total MS4",{"$f":"COUNT(E12:E13)+COUNTIF(E12:E13,\"A\")","v":0},0,0,0,0,0,0,0,0,0,0,0,0,0,0,0,0,0,0,0,0,0,0,0,0,0,0,0,0,0,0,0,0,0,0,{"$f":"COUNT(AN12:AN13)","v":0},null,"Bilan des points possibles",null,{"$f":"SUM(AR34,AV34,AZ34,BD34,BH34,BL34,BP34,BT34,BX34,CB34,CF34,CJ34,CN34,CR34,CV34,CZ34,DD34,DH34,DL34,DP34,DT34,DX34,EB34,EF34,EJ34,EN34,ER34,EV34,EZ34,FD34,FH34,FL34,FP34,FT34,FX34,GB34,GF34,GJ34,GN34,GR34,GV34,GZ34,HD34,HH34,HL34,HP34,HT34,HX34,IB34,IF34)","v":0},{"$f":"SUM(AS34,AW34,BA34,BE34,BI34,BM34,BQ34,BU34,BY34,CC34,CG34,CK34,CO34,CS34,CW34,DA34,DE34,DI34,DM34,DQ34,DU34,DY34,EC34,EG34,EK34,EO34,ES34,EW34,FA34,FE34,FI34,FM34,FQ34,FU34,FY34,GC34,GG34,GK34,GO34,GS34,GW34,HA34,HE34,HI34,HM34,HQ34,HU34,HY34,IC34,IG34)","v":0},{"$f":"SUM(AT34,AX34,BB34,BF34,BJ34,BN34,BR34,BV34,BZ34,CD34,CH34,CL34,CP34,CT34,CX34,DB34,DF34,DJ34,DN34,DR34,DV34,DZ34,ED34,EH34,EL34,EP34,ET34,EX34,FB34,FF34,FJ34,FN34,FR34,FV34,FZ34,GD34,GH34,GL34,GP34,GT34,GX34,HB34,HF34,HJ34,HN34,HR34,HV34,HZ34,ID34,IH34)","v":0},{"$f":"SUM(AU34,AY34,BC34,BG34,BK34,BO34,BS34,BW34,CA34,CE34,CI34,CM34,CQ34,CU34,CY34,DC34,DG34,DK34,DO34,DS34,DW34,EA34,EE34,EI34,EM34,EQ34,EU34,EY34,FC34,FG34,FK34,FO34,FS34,FW34,GA34,GE34,GI34,GM34,GQ34,GU34,GY34,HC34,HG34,HK34,HO34,HS34,HW34,IA34,IE34,II34)","v":0},null,null,null,null,null,null,null,null,null,null,null,null,null,null,null,null,null,null,null,null,null,null,null,null,null,null,null,null,null,null,null,null,null,null,null,null,null,null,null,null,null,null,null,null,null,null,null,null,null,null,null,null,null,null,null,null,null,null,null,null,null,null,null,null,null,null,null,null,null,null,null,null,null,null,null,null,null,null,null,null,null,null,null,null,null,null,null,null,null,null,null,null,null,null,null,null,null,null,null,null,null,null,null,null,null,null,null,null,null,null,null,null,null,null,null,null,null,null,null,null,null,null,null,null,null,null,null,null,null,null,null,null,null,null,null,null,null,null,null,null,null,null,null,null,null,null,null,null,null,null,null,null,null,null,null,null,null,null,null,null,null,null,null,null,null,null,null,null,null,null,null,null,null,null,null,null,null,null,null,null,null,null,null,null,null,null,null,null,null,null,null,null,null,null,null,null,null,null,null,null,null,null,null,null,null,null,null,null,null,null,null,null,null,null,null,null,null,null,null,null,null,null,null,null,null,null,null,null,null,null,null,null,null,null,null,null,null,null,null,null,null,null,null,null,null,null,null,null,null,null,null,null,null,null,null,null,null,null,null,null,null,null,null,null,null,null,null,null,null,null,null,null,null,null,null,null,null,null,null,null,null,null,null,null,null,null,null,null,null,null,null,null,null,null,null,null,null,null,null,null,null,null,null,null,null,null,null,null,null,null,null,null,null,null,null,null,null,null,null,null,null,null,null,null,null,null,null,null,null,null,null,null,null,null,null,null,null,null,null,null,null,null,null,null,null,null,null,null,null,null,null,null,null,null,null,null,null,null,null,null,null,null,null,null,null,null,null,null,null,null,null,null,null,null,null,null,null,null,null,null,null,null,null,null,null,null,null,null,null,null,null,null,null,null,null,null,null,null,null,null,null,null,"Bilan des points possibles",null,{"$f":"SUM(QJ34,QN34,QR34,QV34,QZ34,RD34,RH34,RL34,RP34,RT34,RX34,SB34,SF34,SJ34,SN34,SR34,SV34,SZ34,TD34,TH34,TL34,TP34,TT34,TX34,UB34,UF34,UJ34,UN34,UR34,UV34,UZ34,VD34,VH34,VL34,VP34,VT34,VX34,WB34,WF34,WJ34,WN34,WR34,WV34,WZ34,XD34,XH34,XL34,XP34,XT34,XX34)","v":0},{"$f":"SUM(QK34,QO34,QS34,QW34,RA34,RE34,RI34,RM34,RQ34,RU34,RY34,SC34,SG34,SK34,SO34,SS34,SW34,TA34,TE34,TI34,TM34,TQ34,TU34,TY34,UC34,UG34,UK34,UO34,US34,UW34,VA34,VE34,VI34,VM34,VQ34,VU34,VY34,WC34,WG34,WK34,WO34,WS34,WW34,XA34,XE34,XI34,XM34,XQ34,XU34,XY34)","v":0},{"$f":"SUM(QL34,QP34,QT34,QX34,RB34,RF34,RJ34,RN34,RR34,RV34,RZ34,SD34,SH34,SL34,SP34,ST34,SX34,TB34,TF34,TJ34,TN34,TR34,TV34,TZ34,UD34,UH34,UL34,UP34,UT34,UX34,VB34,VF34,VJ34,VN34,VR34,VV34,VZ34,WD34,WH34,WL34,WP34,WT34,WX34,XB34,XF34,XJ34,XN34,XR34,XV34,XZ34)","v":0},{"$f":"SUM(QM34,QQ34,QU34,QY34,RC34,RG34,RK34,RO34,RS34,RW34,SA34,SE34,SI34,SM34,SQ34,SU34,SY34,TC34,TG34,TK34,TO34,TS34,TW34,UA34,UE34,UI34,UM34,UQ34,UU34,UY34,VC34,VG34,VK34,VO34,VS34,VW34,WA34,WE34,WI34,WM34,WQ34,WU34,WY34,XC34,XG34,XK34,XO34,XS34,XW34,YA34)","v":0}]
[null,null,null,"Total FS1",{"$f":"COUNT(E14:E25)+COUNTIF(E14:E25,\"A\")","v":0},0,0,0,0,0,0,0,0,0,0,0,0,0,0,0,0,0,0,0,0,0,0,0,0,0,0,0,0,0,0,0,0,0,0,{"$f":"COUNT(AN14:AN25)","v":0},null,"Total des A de l'élève",null,{"$f":"COUNTIF(AR2:AR31,\"A\")","v":0},0,0,0,0,0,0,0,0,0,0,0,0,0,0,0,0,0,0,0,0,0,0,0,0,0,0,0,0,0,0,0,{"$f":"COUNTIF(BX2:BX31,\"A\")","v":0},0,0,0,0,0,0,0,0,0,0,0,0,0,0,0,0,0,0,0,0,0,0,0,0,0,0,0,0,0,0,0,{"$f":"COUNTIF(DD2:DD31,\"A\")","v":0},0,0,0,0,0,0,0,0,0,0,0,0,0,0,0,0,0,0,0,0,0,0,0,0,0,0,0,0,0,0,0,{"$f":"COUNTIF(EJ2:EJ31,\"A\")","v":0},0,0,0,0,0,0,0,0,0,0,0,0,0,0,0,0,0,0,0,0,0,0,0,0,0,0,0,0,0,0,0,{"$f":"COUNTIF(FP2:FP31,\"A\")","v":0},0,0,0,0,0,0,0,0,0,0,0,0,0,0,0,0,0,0,0,0,0,0,0,0,0,0,0,0,0,0,0,{"$f":"COUNTIF(GV2:GV31,\"A\")","v":0},0,0,0,0,0,0,0,0,0,0,0,0,0,0,0,0,0,0,0,0,0,0,0,0,0,0,0,0,0,0,0,{"$f":"COUNTIF(IB2:IB31,\"A\")","v":0},0,0,0,0,0,0,0,null,null,null,null,null,null,null,null,null,null,null,null,null,null,null,null,null,null,null,null,null,null,null,null,null,null,null,null,null,null,null,null,null,null,null,null,null,null,null,null,null,null,null,null,null,null,null,null,null,null,null,null,null,null,null,null,null,null,null,null,null,null,null,null,null,null,null,null,null,null,null,null,null,null,null,null,null,null,null,null,null,null,null,null,null,null,null,null,null,null,null,null,null,null,null,null,null,null,null,null,null,null,null,null,null,null,null,null,null,null,null,null,null,null,null,null,null,null,null,null,null,null,null,null,null,null,null,null,null,null,null,null,null,null,null,null,null,null,null,null,null,null,null,null,null,null,null,null,null,null,null,null,null,null,null,null,null,null,null,null,null,null,null,null,null,null,null,null,null,null,null,null,null,null,null,null,null,null,null,null,null,null,null,null,null,null,null,null,null,null,null,null,null,null,null,null,null,null,null,null,null,null,null,null,null,null,"Total des A de l'élève",null,{"$f":"SUM(QJ2:QJ31)","v":0},0,0,0,0,0,0,0,0,0,0,0,0,0,0,0,0,0,0,0,0,0,0,0,0,0,0,0,0,0,0,0,{"$f":"SUM(RP2:RP31)","v":0},0,0,0,0,0,0,0,0,0,0,0,0,0,0,0,0,0,0,0,0,0,0,0,0,0,0,0,0,0,0,0,{"$f":"SUM(SV2:SV31)","v":0},0,0,0,0,0,0,0,0,0,0,0,0,0,0,0,0,0,0,0,0,0,0,0,0,0,0,0,0,0,0,0,{"$f":"SUM(UB2:UB31)","v":0},0,0,0,0,0,0,0,0,0,0,0,0,0,0,0,0,0,0,0,0,0,0,0,0,0,0,0,0,0,0,0,{"$f":"SUM(VH2:VH31)","v":0},0,0,0,0,0,0,0,0,0,0,0,0,0,0,0,0,0,0,0,0,0,0,0,0,0,0,0,0,0,0,0,{"$f":"SUM(WN2:WN31)","v":0},0,0,0,0,0,0,0,0,0,0,0,0,0,0,0,0,0,0,0,0,0,0,0,0,0,0,0,0,0,0,0,{"$f":"SUM(XT2:XT31)","v":0},0,0,0,0,0,0,{"$f":"COUNTIF(YA2:YA31,\"A\")","v":0}]
[null,null,null,"Total FS2",{"$f":"COUNT(E26:E27)+COUNTIF(E26:E27,\"A\")","v":0},0,0,0,0,0,0,0,0,0,0,0,0,0,0,0,0,0,0,0,0,0,0,0,0,0,0,0,0,0,0,0,0,0,0,{"$f":"COUNT(AN26:AN27)","v":0},null,"Bilan des A de l'élève",null,{"$f":"SUM(AR36,AV36,AZ36,BD36,BH36,BL36,BP36,BT36,BX36,CB36,CF36,CJ36,CN36,CR36,CV36,CZ36,DD36,DH36,DL36,DP36,DT36,DX36,EB36,EF36,EJ36,EN36,ER36,EV36,EZ36,FD36,FH36,FL36,FP36,FT36,FX36,GB36,GF36,GJ36,GN36,GR36,GV36,GZ36,HD36,HH36,HL36,HP36,HT36,HX36,IB36,IF36)","v":0},{"$f":"SUM(AS36,AW36,BA36,BE36,BI36,BM36,BQ36,BU36,BY36,CC36,CG36,CK36,CO36,CS36,CW36,DA36,DE36,DI36,DM36,DQ36,DU36,DY36,EC36,EG36,EK36,EO36,ES36,EW36,FA36,FE36,FI36,FM36,FQ36,FU36,FY36,GC36,GG36,GK36,GO36,GS36,GW36,HA36,HE36,HI36,HM36,HQ36,HU36,HY36,IC36,IG36)","v":0},{"$f":"SUM(AT36,AX36,BB36,BF36,BJ36,BN36,BR36,BV36,BZ36,CD36,CH36,CL36,CP36,CT36,CX36,DB36,DF36,DJ36,DN36,DR36,DV36,DZ36,ED36,EH36,EL36,EP36,ET36,EX36,FB36,FF36,FJ36,FN36,FR36,FV36,FZ36,GD36,GH36,GL36,GP36,GT36,GX36,HB36,HF36,HJ36,HN36,HR36,HV36,HZ36,ID36,IH36)","v":0},{"$f":"SUM(AU36,AY36,BC36,BG36,BK36,BO36,BS36,BW36,CA36,CE36,CI36,CM36,CQ36,CU36,CY36,DC36,DG36,DK36,DO36,DS36,DW36,EA36,EE36,EI36,EM36,EQ36,EU36,EY36,FC36,FG36,FK36,FO36,FS36,FW36,GA36,GE36,GI36,GM36,GQ36,GU36,GY36,HC36,HG36,HK36,HO36,HS36,HW36,IA36,IE36,II36)","v":0},null,null,null,null,null,null,null,null,null,null,null,null,null,null,null,null,null,null,null,null,null,null,null,null,null,null,null,null,null,null,null,null,null,null,null,null,null,null,null,null,null,null,null,null,null,null,null,null,null,null,null,null,null,null,null,null,null,null,null,null,null,null,null,null,null,null,null,null,null,null,null,null,null,null,null,null,null,null,null,null,null,null,null,null,null,null,null,null,null,null,null,null,null,null,null,null,null,null,null,null,null,null,null,null,null,null,null,null,null,null,null,null,null,null,null,null,null,null,null,null,null,null,null,null,null,null,null,null,null,null,null,null,null,null,null,null,null,null,null,null,null,null,null,null,null,null,null,null,null,null,null,null,null,null,null,null,null,null,null,null,null,null,null,null,null,null,null,null,null,null,null,null,null,null,null,null,null,null,null,null,null,null,null,null,null,null,null,null,null,null,null,null,null,null,null,null,null,null,null,null,null,null,null,null,null,null,null,null,null,null,null,null,null,null,null,null,null,null,null,null,null,null,null,null,null,null,null,null,null,null,null,null,null,null,null,null,null,null,null,null,null,null,null,null,null,null,null,null,null,null,null,null,null,null,null,null,null,null,null,null,null,null,null,null,null,null,null,null,null,null,null,null,null,null,null,null,null,null,null,null,null,null,null,null,null,null,null,null,null,null,null,null,null,null,null,null,null,null,null,null,null,null,null,null,null,null,null,null,null,null,null,null,null,null,null,null,null,null,null,null,null,null,null,null,null,null,null,null,null,null,null,null,null,null,null,null,null,null,null,null,null,null,null,null,null,null,null,null,null,null,null,null,null,null,null,null,null,null,null,null,null,null,null,null,null,null,null,null,null,null,null,null,null,null,null,null,null,null,null,null,null,null,null,null,null,null,null,null,null,null,null,null,null,null,null,null,null,null,null,null,null,null,"Bilan des A de l'élève",null,{"$f":"SUM(QJ36,QN36,QR36,QV36,QZ36,RD36,RH36,RL36,RP36,RT36,RX36,SB36,SF36,SJ36,SN36,SR36,SV36,SZ36,TD36,TH36,TL36,TP36,TT36,TX36,UB36,UF36,UJ36,UN36,UR36,UV36,UZ36,VD36,VH36,VL36,VP36,VT36,VX36,WB36,WF36,WJ36,WN36,WR36,WV36,WZ36,XD36,XH36,XL36,XP36,XT36,XX36)","v":0},{"$f":"SUM(QK36,QO36,QS36,QW36,RA36,RE36,RI36,RM36,RQ36,RU36,RY36,SC36,SG36,SK36,SO36,SS36,SW36,TA36,TE36,TI36,TM36,TQ36,TU36,TY36,UC36,UG36,UK36,UO36,US36,UW36,VA36,VE36,VI36,VM36,VQ36,VU36,VY36,WC36,WG36,WK36,WO36,WS36,WW36,XA36,XE36,XI36,XM36,XQ36,XU36,XY36)","v":0},{"$f":"SUM(QL36,QP36,QT36,QX36,RB36,RF36,RJ36,RN36,RR36,RV36,RZ36,SD36,SH36,SL36,SP36,ST36,SX36,TB36,TF36,TJ36,TN36,TR36,TV36,TZ36,UD36,UH36,UL36,UP36,UT36,UX36,VB36,VF36,VJ36,VN36,VR36,VV36,VZ36,WD36,WH36,WL36,WP36,WT36,WX36,XB36,XF36,XJ36,XN36,XR36,XV36,XZ36)","v":0},{"$f":"SUM(QM36,QQ36,QU36,QY36,RC36,RG36,RK36,RO36,RS36,RW36,SA36,SE36,SI36,SM36,SQ36,SU36,SY36,TC36,TG36,TK36,TO36,TS36,TW36,UA36,UE36,UI36,UM36,UQ36,UU36,UY36,VC36,VG36,VK36,VO36,VS36,VW36,WA36,WE36,WI36,WM36,WQ36,WU36,WY36,XC36,XG36,XK36,XO36,XS36,XW36,YA36)","v":0}]
[null,null,null,"Total FS3",{"$f":"COUNT(E28:E30)+COUNTIF(E28:E30,\"A\")","v":0},0,0,0,0,0,0,0,0,0,0,0,0,0,0,0,0,0,0,0,0,0,0,0,0,0,0,0,0,0,0,0,0,0,0,{"$f":"COUNT(AN28:AN30)","v":0}]
[null,null,null,"Total FS5",{"$f":"COUNT(E31:E31)+COUNTIF(E31:E31,\"A\")","v":0},0,0,0,0,0,0,0,0,0,0,0,0,0,0,0,0,0,0,0,0,0,0,0,0,0,0,0,0,0,0,0,0,0,0,{"$f":"COUNT(AN31:AN31)","v":0},null,"Total des points dans l'évaluation",null,{"$f":"ABH$33","v":0},{"$f":"ABI$33","v":0},0,0,0,0,0,0,3,0,0,0,0,0,0,0,3,0,0,0,15,15,0,0,3,0,0,0,0,3,0,0,0,3,0,0,0,0,0,0,0,0,0,3,0,6,0,0,0,0,0,0,3,3,0,0,3,0,0,0,0,9,3,0,0,{"$f":"ADU$33","v":3},0,0,0,0,0,0,0,0,0,0,6,0,0,0,3,0,0,0,0,0,0,0,0,3,0,0,0,0,0,0,0,0,0,0,0,0,0,0,0,0,0,0,0,0,0,0,0,0,0,0,0,0,0,0,0,0,0,0,0,0,0,0,0,{"$f":"AGG$33","v":0},0,0,0,0,0,0,0,0,0,0,0,0,0,0,0,0,0,0,0,0,0,0,0,0,0,0,0,0,0,0,0,0,0,0,0,0,0,0,0,0,0,0,0,0,0,0,0,0,0,0,0,0,0,0,0,0,0,0,0,0,0,0,0,{"$f":"AIS$33","v":0},0,0,0,0,0,0]
["Pour éviter l'autocomplétion :",null,null,null,"A","A","A","A","A","A","A","A","A","A","A","A","A","A","A","A","A","A","A","A","A","A","A","A","A","A","A","A","A","A","A","A","A","A","A"]

{"sheet":"Imprimer","index":4,"n_rows":42,"n_cols":11,"rows_kept":42,"cut":false,"hidden":false,"merged":[[0,0,0,6],[1,0,1,6],[2,1,3,1]]}
["IMPRIMER"]
[]
[null,"1. Pour un document sur des élèves, sélectionnez les élèves.",null,"2. Sélectionnez les documents."]
[]
[]
[null,"Élèves","Choix","Documents sur les élèves","Choix","Documents sur la classe","Choix"]
[1,{"$f":"Élèves!D2","v":" "},null,"Bilan - élève",null,"Bilan - classe",null,null,false,false,false]
[{"$f":"IF(ISTEXT(B8),A7+1,\"\")","v":2},{"$f":"Élèves!D3","v":" "},null,"Réussites - élève",null,"Réussites - classe",null,null,false,false,false]
[{"$f":"IF(ISTEXT(B9),A8+1,\"\")","v":3},{"$f":"Élèves!D4","v":" "},null,null,null,"Groupes de besoin",null,null,false,null,false]
[4,{"$f":"Élèves!D5","v":" "},null,null,null,"Synthèse - classe",null,null,false,null,false]
[5,{"$f":"Élèves!D6","v":" "},null,null,null,"Profil - classe",null,null,false,null,false]
[6,{"$f":"Élèves!D7","v":" "},null,null,null,null,null,null,false]
[7,{"$f":"Élèves!D8","v":" "},null,null,null,null,null,null,false]
[8,{"$f":"Élèves!D9","v":" "},null,null,null,null,null,null,false]
[9,{"$f":"Élèves!D10","v":" "},null,null,null,null,null,null,false]
[10,{"$f":"Élèves!D11","v":" "},null,null,null,null,null,null,false]
[11,{"$f":"Élèves!D12","v":" "},null,null,null,null,null,null,false,{"$f":"COUNTIF(J7:J11,TRUE)","v":0},{"$f":"COUNTIF(K7:K11,TRUE)","v":0}]
[12,{"$f":"Élèves!D13","v":" "},null,"3. Sélectionnez le format.",null,"Pour obtenir un document,",null,null,false]
[13,{"$f":"Élèves!D14","v":" "},null,null,null,"respectez les étapes 1, 2, 3.",null,null,false]
[14,{"$f":"Élèves!D15","v":" "},null,null,null,null,null,null,false]
[15,{"$f":"Élèves!D16","v":" "},null,"Format des documents","Choix","Nombre de documents :",{"$f":"($I$42*$J$17+$K$17)*$J$24","v":0},null,false]
[16,{"$f":"Élèves!D17","v":" "},null,"Papier",null,null,null,null,false,true]
[17,{"$f":"Élèves!D18","v":" "},null,"PDF",null,null,null,null,false,false]
[18,{"$f":"Élèves!D19","v":" "},null,null,null,null,null,null,false,{"$f":"COUNTIF(J22:J23,TRUE)","v":1}]
[19,{"$f":"Élèves!D20","v":" "},null,null,null,null,null,null,false]
[20,{"$f":"Élèves!D21","v":" "},null,null,null,"Avant d'imprimer :",null,null,false]
[21,{"$f":"Élèves!D22","v":" "},null,null,null,"1. Sélectionner l'imprimante à partir du menu Fichier/Imprimer.",null,null,false]
[22,{"$f":"Élèves!D23","v":" "},null,null,null,"2. Afficher le panneau de configuration Windows et sélectionner ",null,null,false]
[23,{"$f":"Élèves!D24","v":" "},null,null,null,"l'imprimante pour éventuellement annuler des impressions.",null,null,false]
[24,{"$f":"Élèves!D25","v":" "},null,null,null,"3. Enregistrer ce fichier Excel dans le répertoire souhaité.",null,null,false]
[25,{"$f":"Élèves!D26","v":" "},null,null,null,null,null,null,false]
[26,{"$f":"Élèves!D27","v":" "},null,null,null,"Conseil :",null,null,false]
[27,{"$f":"Élèves!D28","v":" "},null,null,null,"N'imprimer le classement des items - élève que pour les élèves",null,null,false]
[28,{"$f":"Élèves!D29","v":" "},null,null,null,"en difficulté.",null,null,false]
[29,{"$f":"Élèves!D30","v":" "},null,null,null,null,null,null,false]
[30,{"$f":"Élèves!D31","v":" "},null,null,null,null,null,null,false]
[31,{"$f":"Élèves!D32","v":" "},null,null,null,null,null,null,false]
[32,{"$f":"Élèves!D33","v":" "},null,null,null,null,null,null,false]
[33,{"$f":"Élèves!D34","v":" "},null,null,null,null,null,null,false]
[34,{"$f":"Élèves!D35","v":" "},null,null,null,null,null,null,false]
[35,{"$f":"Élèves!D36","v":" "},null,null,null,null,null,null,false]
[null,null,null,null,null,null,null,null,{"$f":"COUNTIF(I7:I41,TRUE)","v":0}]

{"sheet":"Bilan - élève","index":5,"n_rows":92,"n_cols":25,"rows_kept":92,"cut":false,"hidden":false,"merged":[[87,3,87,6],[86,3,86,6],[83,0,83,6],[76,3,76,6],[0,0,0,4],[3,0,3,6],[68,0,68,6],[74,0,74,6],[52,0,52,6],[5,3,5,6],[5,7,5,8],[61,3,61,6],[61,7,61,8],[54,3,54,6],[54,7,54,8],[42,3,42,6],[42,7,42,8]]}
[" ",null,null,null,null,null,"CE2",null,null,{"$f":"MATCH(A1,liste_des_eleves,0)","v":1},null,null,null,null,null,null,null,null,null,null,null,null,null,null,"Pour sélectionner un élève,"]
["Académie de Paris",null,null,null,null,null,{"$f":"IF(ISBLANK(Informations!$B$2),\"\",Informations!$B$2)","v":"2016-2017"},null,null,null,null,null,null,null,null,null,null,null,null,null,null,null,null,null,"cliquez sur la flèche à gauche."]
[]
["BILAN DE L'ÉVALUATION DIAGNOSTIQUE"]
[]
[null,null,null,"Par niveau de difficulté",null,null,null,"Total"]
[null,null,null,1,2,3,4,"/","¡",null,1,2,3,4,1,2,3,4,null,"Difficulté","Facilité",null,"Dénominateur"]
["#","Français",null,{"$f":"IF(SUM(O10:O25)>0,SUM(K10:K25)/SUM(O10:O25),\"\")","v":""},{"$f":"IF(SUM(P10:P25)>0,SUM(L10:L25)/SUM(P10:P25),\"\")","v":""},{"$f":"IF(SUM(Q10:Q25)>0,SUM(M10:M25)/SUM(Q10:Q25),\"\")","v":""},{"$f":"IF(SUM(R10:R25)>0,SUM(N10:N25)/SUM(R10:R25),\"\")","v":""},{"$f":"IF(W8>0,SUM(K10:N25)&\"/\"&W8,\"\")","v":""},{"$f":"IF(W8>0,ROUND(SUM(K10:N25)/W8,2),\"\")","v":""},null,null,null,null,null,null,null,null,null,null,null,null,null,{"$f":"SUM(O10:R25)","v":0}]
[null,{"$f":"Programmes!E2","v":"Langage oral"},null,{"$f":"IF(SUM(O10:O13)>0,SUM(K10:K13)/SUM(O10:O13),\"\")","v":""},{"$f":"IF(SUM(P10:P13)>0,SUM(L10:L13)/SUM(P10:P13),\"\")","v":""},{"$f":"IF(SUM(Q10:Q13)>0,SUM(M10:M13)/SUM(Q10:Q13),\"\")","v":""},{"$f":"IF(SUM(R10:R13)>0,SUM(N10:N13)/SUM(R10:R13),\"\")","v":""},{"$f":"IF(W9>0,SUM(K10:N13)&\"/\"&W9,\"\")","v":""},{"$f":"IF(SUM(O10:R13)>0,ROUND(SUM(K10:N13)/SUM(O10:R13),2),\"\")","v":""},null,null,null,null,null,null,null,null,null,null,null,null,null,{"$f":"SUM(O10:R13)","v":0}]
[{"$f":"Programmes!C2","v":1},{"$f":"Programmes!B2","v":"Conserver une attention soutenue et manifester, si besoin et à bon escient, son incompréhension."},null,{"$f":"IF(O10>0,K10/O10,\"\")","v":""},"","","",{"$f":"IF(W10>0,SUM(K10:N10)&\"/\"&W10,\"\")","v":""},{"$f":"IF(SUM(O10:R10)>0,ROUND(SUM(K10:N10)/SUM(O10:R10),2),\"\")","v":""},1,{"$f":"INDEX(tri_des_resultats,($J10-1)*4+D$7)","v":0},0,0,0,{"$f":"INDEX(tri_des_possibles,($J10-1)*4+D$7)","v":0},0,0,0,null,{"$f":"1*O10+2*P10+3*Q10+4*R10","v":0},{"$f":"4*O10+3*P10+2*Q10+1*R10","v":0},null,{"$f":"SUM(O10:R10)","v":0}]
[{"$f":"Programmes!C3","v":2},{"$f":"Programmes!B3","v":"Produire des énoncés clairs en tenant compte de l’objet du propos et des interlocuteurs."},null,{"$f":"IF(O11>0,K11/O11,\"\")","v":""},{"$f":"IF(P11>0,L11/P11,\"\")","v":""},{"$f":"IF(Q11>0,M11/Q11,\"\")","v":""},{"$f":"IF(R11>0,N11/R11,\"\")","v":""},{"$f":"IF(W11>0,SUM(K11:N11)&\"/\"&W11,\"\")","v":""},{"$f":"IF(SUM(O11:R11)>0,ROUND(SUM(K11:N11)/SUM(O11:R11),2),\"\")","v":""},2,{"$f":"INDEX(tri_des_resultats,($J11-1)*4+D$7)","v":0},{"$f":"INDEX(tri_des_resultats,($J11-1)*4+E$7)","v":0},{"$f":"INDEX(tri_des_resultats,($J11-1)*4+F$7)","v":0},{"$f":"INDEX(tri_des_resultats,($J11-1)*4+G$7)","v":0},{"$f":"INDEX(tri_des_possibles,($J11-1)*4+D$7)","v":0},{"$f":"INDEX(tri_des_possibles,($J11-1)*4+E$7)","v":0},{"$f":"INDEX(tri_des_possibles,($J11-1)*4+F$7)","v":0},{"$f":"INDEX(tri_des_possibles,($J11-1)*4+G$7)","v":0},null,{"$f":"1*O11+2*P11+3*Q11+4*R11","v":0},{"$f":"4*O11+3*P11+2*Q11+1*R11","v":0},null,{"$f":"SUM(O11:R11)","v":0}]
[{"$f":"Programmes!C4","v":3},{"$f":"Programmes!B4","v":"Pratiquer avec efficacité les formes de discours attendues - notamment raconter, décrire, expliquer."},null,"","","","",{"$f":"IF(W12>0,SUM(K12:N12)&\"/\"&W12,\"\")","v":""},{"$f":"IF(SUM(O12:R12)>0,ROUND(SUM(K12:N12)/SUM(O12:R12),2),\"\")","v":""},3,0,0,0,0,0,0,0,0,null,{"$f":"1*O12+2*P12+3*Q12+4*R12","v":0},{"$f":"4*O12+3*P12+2*Q12+1*R12","v":0},null,{"$f":"SUM(O12:R12)","v":0}]
[{"$f":"Programmes!C5","v":4},{"$f":"Programmes!B5","v":"Participer avec pertinence à un échange."},null,"","","","",{"$f":"IF(W13>0,SUM(K13:N13)&\"/\"&W13,\"\")","v":""},{"$f":"IF(SUM(O13:R13)>0,ROUND(SUM(K13:N13)/SUM(O13:R13),2),\"\")","v":""},4,0,0,0,0,0,0,0,0,null,{"$f":"1*O13+2*P13+3*Q13+4*R13","v":0},{"$f":"4*O13+3*P13+2*Q13+1*R13","v":0},null,{"$f":"SUM(O13:R13)","v":0}]
[null,{"$f":"Programmes!E6","v":"Lecture et compréhension de l'écrit"},null,{"$f":"IF(SUM(O15:O17)>0,SUM(K15:K17)/SUM(O15:O17),\"\")","v":""},{"$f":"IF(SUM(P15:P17)>0,SUM(L15:L17)/SUM(P15:P17),\"\")","v":""},{"$f":"IF(SUM(Q15:Q17)>0,SUM(M15:M17)/SUM(Q15:Q17),\"\")","v":""},{"$f":"IF(SUM(R15:R17)>0,SUM(N15:N17)/SUM(R15:R17),\"\")","v":""},{"$f":"IF(W14>0,SUM(K15:N17)&\"/\"&W14,\"\")","v":""},{"$f":"IF(SUM(O15:R17)>0,ROUND(SUM(K15:N17)/SUM(O15:R17),2),\"\")","v":""},null,null,null,null,null,null,null,null,null,null,null,null,null,{"$f":"SUM(O15:R17)","v":0}]
[{"$f":"Programmes!C6","v":5},{"$f":"Programmes!B6","v":"Identifier des mots rapidement."},null,{"$f":"IF(O15>0,K15/O15,\"\")","v":""},{"$f":"IF(P15>0,L15/P15,\"\")","v":""},{"$f":"IF(Q15>0,M15/Q15,\"\")","v":""},{"$f":"IF(R15>0,N15/R15,\"\")","v":""},{"$f":"IF(W15>0,SUM(K15:N15)&\"/\"&W15,\"\")","v":""},{"$f":"IF(SUM(O15:R15)>0,ROUND(SUM(K15:N15)/SUM(O15:R15),2),\"\")","v":""},5,{"$f":"INDEX(tri_des_resultats,($J15-1)*4+D$7)","v":0},{"$f":"INDEX(tri_des_resultats,($J15-1)*4+E$7)","v":0},{"$f":"INDEX(tri_des_resultats,($J15-1)*4+F$7)","v":0},{"$f":"INDEX(tri_des_resultats,($J15-1)*4+G$7)","v":0},{"$f":"INDEX(tri_des_possibles,($J15-1)*4+D$7)","v":0},{"$f":"INDEX(tri_des_possibles,($J15-1)*4+E$7)","v":0},{"$f":"INDEX(tri_des_possibles,($J15-1)*4+F$7)","v":0},{"$f":"INDEX(tri_des_possibles,($J15-1)*4+G$7)","v":0},null,{"$f":"1*O15+2*P15+3*Q15+4*R15","v":0},{"$f":"4*O15+3*P15+2*Q15+1*R15","v":0},null,{"$f":"SUM(O15:R15)","v":0}]
[{"$f":"Programmes!C7","v":6},{"$f":"Programmes!B7","v":"Lire et comprendre des textes adaptés à la maturité et à la culture scolaire des élèves."},null,"","","","",{"$f":"IF(W16>0,SUM(K16:N16)&\"/\"&W16,\"\")","v":""},{"$f":"IF(SUM(O16:R16)>0,ROUND(SUM(K16:N16)/SUM(O16:R16),2),\"\")","v":""},6,0,0,0,0,0,0,0,0,null,{"$f":"1*O16+2*P16+3*Q16+4*R16","v":0},{"$f":"4*O16+3*P16+2*Q16+1*R16","v":0},null,{"$f":"SUM(O16:R16)","v":0}]
[{"$f":"Programmes!C8","v":7},{"$f":"Programmes!B8","v":"Lire à voix haute avec fluidité, après préparation, un texte d’une demi-page."},null,"","","","",{"$f":"IF(W17>0,SUM(K17:N17)&\"/\"&W17,\"\")","v":""},{"$f":"IF(SUM(O17:R17)>0,ROUND(SUM(K17:N17)/SUM(O17:R17),2),\"\")","v":""},7,0,0,0,0,0,0,0,0,null,0,{"$f":"4*O17+3*P17+2*Q17+1*R17","v":0},null,0]
[null,{"$f":"Programmes!E9","v":"Écriture"},null,{"$f":"IF(SUM(O19:O21)>0,SUM(K19:K21)/SUM(O19:O21),\"\")","v":""},{"$f":"IF(SUM(P19:P21)>0,SUM(L19:L21)/SUM(P19:P21),\"\")","v":""},{"$f":"IF(SUM(Q19:Q21)>0,SUM(M19:M21)/SUM(Q19:Q21),\"\")","v":""},{"$f":"IF(SUM(R19:R21)>0,SUM(N19:N21)/SUM(R19:R21),\"\")","v":""},{"$f":"IF(W18>0,SUM(K19:N21)&\"/\"&W18,\"\")","v":""},{"$f":"IF(SUM(O19:R21)>0,ROUND(SUM(K19:N21)/SUM(O19:R21),2),\"\")","v":""},null,null,null,null,null,null,null,null,null,null,null,null,null,{"$f":"SUM(O19:R21)","v":0}]
[{"$f":"Programmes!C9","v":8},{"$f":"Programmes!B9","v":"Copier ou transcrire, dans une écriture lisible, un texte d’une dizaine de lignes."},null,{"$f":"IF(O19>0,K19/O19,\"\")","v":""},"","","",{"$f":"IF(W19>0,SUM(K19:N19)&\"/\"&W19,\"\")","v":""},{"$f":"IF(SUM(O19:R19)>0,ROUND(SUM(K19:N19)/SUM(O19:R19),2),\"\")","v":""},8,{"$f":"INDEX(tri_des_resultats,($J19-1)*4+D$7)","v":0},0,0,0,{"$f":"INDEX(tri_des_possibles,($J19-1)*4+D$7)","v":0},0,0,0,null,{"$f":"1*O19+2*P19+3*Q19+4*R19","v":0},{"$f":"4*O19+3*P19+2*Q19+1*R19","v":0},null,{"$f":"SUM(O19:R19)","v":0}]
[{"$f":"Programmes!C10","v":9},{"$f":"Programmes!B10","v":"Rédiger un texte d’environ une demi-page, cohérent, organisé, ponctué, pertinent."},null,{"$f":"IF(O20>0,K20/O20,\"\")","v":""},{"$f":"IF(P20>0,L20/P20,\"\")","v":""},{"$f":"IF(Q20>0,M20/Q20,\"\")","v":""},{"$f":"IF(R20>0,N20/R20,\"\")","v":""},{"$f":"IF(SUM(O20:R20)>0,SUM(K20:N20)&\"/\"&SUM(O20:R20),\"\")","v":""},{"$f":"IF(SUM(O20:R20)>0,ROUND(SUM(K20:N20)/SUM(O20:R20),2),\"\")","v":""},9,{"$f":"INDEX(tri_des_resultats,($J20-1)*4+D$7)","v":0},{"$f":"INDEX(tri_des_resultats,($J20-1)*4+E$7)","v":0},{"$f":"INDEX(tri_des_resultats,($J20-1)*4+F$7)","v":0},{"$f":"INDEX(tri_des_resultats,($J20-1)*4+G$7)","v":0},{"$f":"INDEX(tri_des_possibles,($J20-1)*4+D$7)","v":0},{"$f":"INDEX(tri_des_possibles,($J20-1)*4+E$7)","v":0},{"$f":"INDEX(tri_des_possibles,($J20-1)*4+F$7)","v":0},{"$f":"INDEX(tri_des_possibles,($J20-1)*4+G$7)","v":0},null,{"$f":"1*O20+2*P20+3*Q20+4*R20","v":0},{"$f":"4*O20+3*P20+2*Q20+1*R20","v":0},null,{"$f":"SUM(O20:R20)","v":0}]
[{"$f":"Programmes!C11","v":10},{"$f":"Programmes!B11","v":"Améliorer une production, notamment l’orthographe, en tenant compte d’indications."},null,"","","","",{"$f":"IF(SUM(O21:R21)>0,SUM(K21:N21)&\"/\"&SUM(O21:R21),\"\")","v":""},{"$f":"IF(SUM(O21:R21)>0,ROUND(SUM(K21:N21)/SUM(O21:R21),2),\"\")","v":""},10,0,0,0,0,0,0,0,0,null,{"$f":"1*O21+2*P21+3*Q21+4*R21","v":0},{"$f":"4*O21+3*P21+2*Q21+1*R21","v":0},null,0]
[null,{"$f":"Programmes!E12","v":"Étude de la langue (grammaire, orthographe, lexique)"},null,{"$f":"IF(SUM(O23:O25)>0,SUM(K23:K25)/SUM(O23:O25),\"\")","v":""},{"$f":"IF(SUM(P23:P25)>0,SUM(L23:L25)/SUM(P23:P25),\"\")","v":""},{"$f":"IF(SUM(Q23:Q25)>0,SUM(M23:M25)/SUM(Q23:Q25),\"\")","v":""},{"$f":"IF(SUM(R23:R25)>0,SUM(N23:N25)/SUM(R23:R25),\"\")","v":""},{"$f":"IF(W22>0,SUM(K23:N25)&\"/\"&W22,\"\")","v":""},{"$f":"IF(SUM(O23:R25)>0,ROUND(SUM(K23:N25)/SUM(O23:R25),2),\"\")","v":""},null,null,null,null,null,null,null,null,null,null,null,null,null,{"$f":"SUM(O23:R25)","v":0}]
[{"$f":"Programmes!C12","v":11},{"$f":"Programmes!B12","v":"Orthographier les mots les plus fréquents et les mots invariables mémorisés."},null,{"$f":"IF(O23>0,K23/O23,\"\")","v":""},"","","",{"$f":"IF(W23>0,SUM(K23:N23)&\"/\"&W23,\"\")","v":""},{"$f":"IF(SUM(O23:R23)>0,ROUND(SUM(K23:N23)/SUM(O23:R23),2),\"\")","v":""},11,{"$f":"INDEX(tri_des_resultats,($J23-1)*4+D$7)","v":0},0,0,0,{"$f":"INDEX(tri_des_possibles,($J23-1)*4+D$7)","v":0},0,0,0,null,{"$f":"1*O23+2*P23+3*Q23+4*R23","v":0},{"$f":"4*O23+3*P23+2*Q23+1*R23","v":0},null,{"$f":"SUM(O23:R23)","v":0}]
[{"$f":"Programmes!C13","v":12},{"$f":"Programmes!B13","v":"Raisonner pour réaliser les accords dans le groupe nominal et entre le verbe et son sujet."},null,"","","","",{"$f":"IF(W24>0,SUM(K24:N24)&\"/\"&W24,\"\")","v":""},{"$f":"IF(SUM(O24:R24)>0,ROUND(SUM(K24:N24)/SUM(O24:R24),2),\"\")","v":""},12,0,0,0,0,0,0,0,0,null,{"$f":"1*O24+2*P24+3*Q24+4*R24","v":0},{"$f":"4*O24+3*P24+2*Q24+1*R24","v":0},null,{"$f":"SUM(O24:R24)","v":0}]
[{"$f":"Programmes!C14","v":13},{"$f":"Programmes!B14","v":"Utiliser ses connaissances sur la langue. "},null,{"$f":"IF(O25>0,K25/O25,\"\")","v":""},{"$f":"IF(P25>0,L25/P25,\"\")","v":""},{"$f":"IF(Q25>0,M25/Q25,\"\")","v":""},{"$f":"IF(R25>0,N25/R25,\"\")","v":""},{"$f":"IF(W25>0,SUM(K25:N25)&\"/\"&W25,\"\")","v":""},{"$f":"IF(SUM(O25:R25)>0,ROUND(SUM(K25:N25)/SUM(O25:R25),2),\"\")","v":""},13,{"$f":"INDEX(tri_des_resultats,($J25-1)*4+D$7)","v":0},{"$f":"INDEX(tri_des_resultats,($J25-1)*4+E$7)","v":0},{"$f":"INDEX(tri_des_resultats,($J25-1)*4+F$7)","v":0},{"$f":"INDEX(tri_des_resultats,($J25-1)*4+G$7)","v":0},{"$f":"INDEX(tri_des_possibles,($J25-1)*4+D$7)","v":0},{"$f":"INDEX(tri_des_possibles,($J25-1)*4+E$7)","v":0},{"$f":"INDEX(tri_des_possibles,($J25-1)*4+F$7)","v":0},{"$f":"INDEX(tri_des_possibles,($J25-1)*4+G$7)","v":0},null,{"$f":"1*O25+2*P25+3*Q25+4*R25","v":0},{"$f":"4*O25+3*P25+2*Q25+1*R25","v":0},null,0]
[]
["#","Mathématiques",null,{"$f":"IF(SUM(O29:O41)>0,SUM(K29:K41)/SUM(O29:O41),\"\")","v":""},{"$f":"IF(SUM(P29:P41)>0,SUM(L29:L41)/SUM(P29:P41),\"\")","v":""},{"$f":"IF(SUM(Q29:Q41)>0,SUM(M29:M41)/SUM(Q29:Q41),\"\")","v":""},{"$f":"IF(SUM(R29:R41)>0,SUM(N29:N41)/SUM(R29:R41),\"\")","v":""},{"$f":"IF(W27>0,SUM(K29:N41)&\"/\"&W27,\"\")","v":""},{"$f":"IF(SUM(O29:R41)>0,ROUND(SUM(K29:N41)/SUM(O29:R41),2),\"\")","v":""},null,null,null,null,null,null,null,null,null,null,null,null,null,{"$f":"SUM(O29:R41)","v":0}]
[null,{"$f":"Programmes!E15","v":"Nombres et calculs"},null,{"$f":"IF(SUM(O29:O32)>0,SUM(K29:K32)/SUM(O29:O32),\"\")","v":""},{"$f":"IF(SUM(P29:P32)>0,SUM(L29:L32)/SUM(P29:P32),\"\")","v":""},{"$f":"IF(SUM(Q29:Q32)>0,SUM(M29:M32)/SUM(Q29:Q32),\"\")","v":""},{"$f":"IF(SUM(R29:R32)>0,SUM(N29:N32)/SUM(R29:R32),\"\")","v":""},{"$f":"IF(W28>0,SUM(K29:N32)&\"/\"&W28,\"\")","v":""},{"$f":"IF(SUM(O29:R32)>0,ROUND(SUM(K29:N32)/SUM(O29:R32),2),\"\")","v":""},null,null,null,null,null,null,null,null,null,null,null,null,null,{"$f":"SUM(O29:R32)","v":0}]
[{"$f":"Programmes!C15","v":14},{"$f":"Programmes!B15","v":"Comprendre et utiliser des nombres entiers pour dénombrer, ordonner, repérer, comparer."},null,{"$f":"IF(O29>0,K29/O29,\"\")","v":""},{"$f":"IF(P29>0,L29/P29,\"\")","v":""},{"$f":"IF(Q29>0,M29/Q29,\"\")","v":""},{"$f":"IF(R29>0,N29/R29,\"\")","v":""},{"$f":"IF(W29>0,SUM(K29:N29)&\"/\"&W29,\"\")","v":""},{"$f":"IF(SUM(O29:R29)>0,ROUND(SUM(K29:N29)/SUM(O29:R29),2),\"\")","v":""},1,{"$f":"INDEX(tri_des_resultats,($J29+12)*4+D$7)","v":0},0,0,0,{"$f":"INDEX(tri_des_possibles,($J29+12)*4+D$7)","v":0},0,0,0,null,{"$f":"1*O29+2*P29+3*Q29+4*R29","v":0},{"$f":"4*O29+3*P29+2*Q29+1*R29","v":0},null,{"$f":"SUM(O29:R29)","v":0}]
[{"$f":"Programmes!C16","v":15},{"$f":"Programmes!B16","v":"Nommer, lire, écrire, représenter des nombres entiers."},null,"","","","",{"$f":"IF(W30>0,SUM(K30:N30)&\"/\"&W30,\"\")","v":""},{"$f":"IF(SUM(O30:R30)>0,ROUND(SUM(K30:N30)/SUM(O30:R30),2),\"\")","v":""},2,0,0,0,0,0,0,0,0,null,0,0,null,{"$f":"SUM(O30:R30)","v":0}]
[{"$f":"Programmes!C17","v":16},{"$f":"Programmes!B17","v":"Résoudre des problèmes en utilisant des nombres entiers et le calcul."},null,"","","","",{"$f":"IF(W31>0,SUM(K31:N31)&\"/\"&W31,\"\")","v":""},{"$f":"IF(SUM(O31:R31)>0,ROUND(SUM(K31:N31)/SUM(O31:R31),2),\"\")","v":""},3,0,0,0,0,0,0,0,0,null,0,0,null,0]
[{"$f":"Programmes!C18","v":17},{"$f":"Programmes!B18","v":"Calculer avec des nombres entiers."},null,"","","","",{"$f":"IF(W32>0,SUM(K32:N32)&\"/\"&W32,\"\")","v":""},{"$f":"IF(SUM(O32:R32)>0,ROUND(SUM(K32:N32)/SUM(O32:R32),2),\"\")","v":""},4,0,0,0,0,0,0,0,0,null,0,0,null,0]
[null,{"$f":"Programmes!E19","v":"Grandeurs et mesures"},null,{"$f":"IF(SUM(O34:O36)>0,SUM(K34:K36)/SUM(O34:O36),\"\")","v":""},{"$f":"IF(SUM(P34:P36)>0,SUM(L34:L36)/SUM(P34:P36),\"\")","v":""},{"$f":"IF(SUM(Q34:Q36)>0,SUM(M34:M36)/SUM(Q34:Q36),\"\")","v":""},{"$f":"IF(SUM(R34:R36)>0,SUM(N34:N36)/SUM(R34:R36),\"\")","v":""},{"$f":"IF(W33>0,SUM(K34:N36)&\"/\"&W33,\"\")","v":""},{"$f":"IF(SUM(O34:R36)>0,ROUND(SUM(K34:N36)/SUM(O34:R36),2),\"\")","v":""},null,null,null,null,null,null,null,null,null,null,null,null,null,{"$f":"SUM(O34:R36)","v":0}]
[{"$f":"Programmes!C19","v":18},{"$f":"Programmes!B19","v":"Comparer, estimer, mesurer des longueurs, des masses, des contenances, des durées."},null,{"$f":"IF(O34>0,K34/O34,\"\")","v":""},"","","",{"$f":"IF(W34>0,SUM(K34:N34)&\"/\"&W34,\"\")","v":""},{"$f":"IF(SUM(O34:R34)>0,ROUND(SUM(K34:N34)/SUM(O34:R34),2),\"\")","v":""},5,{"$f":"INDEX(tri_des_resultats,($J34+12)*4+D$7)","v":0},0,0,0,{"$f":"INDEX(tri_des_possibles,($J34+12)*4+D$7)","v":0},0,0,0,null,{"$f":"1*O34+2*P34+3*Q34+4*R34","v":0},{"$f":"4*O34+3*P34+2*Q34+1*R34","v":0},null,{"$f":"SUM(O34:R34)","v":0}]
[{"$f":"Programmes!C20","v":19},{"$f":"Programmes!B20","v":"Utiliser le lexique, les unités, les instruments de mesures spécifiques de ces grandeurs."},null,"","","","",{"$f":"IF(W35>0,SUM(K35:N35)&\"/\"&W35,\"\")","v":""},{"$f":"IF(SUM(O35:R35)>0,ROUND(SUM(K35:N35)/SUM(O35:R35),2),\"\")","v":""},6,0,0,0,0,0,0,0,0,null,{"$f":"1*O35+2*P35+3*Q35+4*R35","v":0},{"$f":"4*O35+3*P35+2*Q35+1*R35","v":0},null,{"$f":"SUM(O35:R35)","v":0}]
[{"$f":"Programmes!C21","v":20},{"$f":"Programmes!B21","v":"Résoudre des problèmes impliquant des longueurs, des masses, des contenances, des durées…"},null,"","","","",{"$f":"IF(W36>0,SUM(K36:N36)&\"/\"&W36,\"\")","v":""},{"$f":"IF(SUM(O36:R36)>0,ROUND(SUM(K36:N36)/SUM(O36:R36),2),\"\")","v":""},7,0,0,0,0,0,0,0,0,null,{"$f":"1*O36+2*P36+3*Q36+4*R36","v":0},{"$f":"4*O36+3*P36+2*Q36+1*R36","v":0},null,0]
[null,{"$f":"Programmes!E22","v":"Espace et géométrie"},null,{"$f":"IF(SUM(O38:O41)>0,SUM(K38:K41)/SUM(O38:O41),\"\")","v":""},{"$f":"IF(SUM(P38:P41)>0,SUM(L38:L41)/SUM(P38:P41),\"\")","v":""},{"$f":"IF(SUM(Q38:Q41)>0,SUM(M38:M41)/SUM(Q38:Q41),\"\")","v":""},{"$f":"IF(SUM(R38:R41)>0,SUM(N38:N41)/SUM(R38:R41),\"\")","v":""},{"$f":"IF(W37>0,SUM(K38:N41)&\"/\"&W37,\"\")","v":""},{"$f":"IF(SUM(O38:R41)>0,ROUND(SUM(K38:N41)/SUM(O38:R41),2),\"\")","v":""},null,null,null,null,null,null,null,null,null,null,null,null,null,{"$f":"SUM(O38:R41)","v":0}]
[{"$f":"Programmes!C22","v":21},{"$f":"Programmes!B22","v":"(Se) repérer et (se) déplacer en utilisant des repères et des représentations."},null,{"$f":"IF(O38>0,K38/O38,\"\")","v":""},"","","",{"$f":"IF(W38>0,SUM(K38:N38)&\"/\"&W38,\"\")","v":""},{"$f":"IF(SUM(O38:R38)>0,ROUND(SUM(K38:N38)/SUM(O38:R38),2),\"\")","v":""},8,{"$f":"INDEX(tri_des_resultats,($J38+12)*4+D$7)","v":0},0,0,0,{"$f":"INDEX(tri_des_possibles,($J38+12)*4+D$7)","v":0},0,0,0,null,{"$f":"1*O38+2*P38+3*Q38+4*R38","v":0},{"$f":"4*O38+3*P38+2*Q38+1*R38","v":0},null,{"$f":"SUM(O38:R38)","v":0}]
[{"$f":"Programmes!C23","v":22},{"$f":"Programmes!B23","v":"Reconnaitre, nommer, décrire, reproduire quelques solides."},null,"","","","",{"$f":"IF(W39>0,SUM(K39:N39)&\"/\"&W39,\"\")","v":""},{"$f":"IF(SUM(O39:R39)>0,ROUND(SUM(K39:N39)/SUM(O39:R39),2),\"\")","v":""},9,0,0,0,0,0,0,0,0,null,{"$f":"1*O39+2*P39+3*Q39+4*R39","v":0},{"$f":"4*O39+3*P39+2*Q39+1*R39","v":0},null,{"$f":"SUM(O39:R39)","v":0}]
[{"$f":"Programmes!C24","v":23},{"$f":"Programmes!B24","v":"Reconnaitre, nommer, décrire, reproduire, construire quelques figures géométriques."},null,"","","","",{"$f":"IF(W40>0,SUM(K40:N40)&\"/\"&W40,\"\")","v":""},{"$f":"IF(SUM(O40:R40)>0,ROUND(SUM(K40:N40)/SUM(O40:R40),2),\"\")","v":""},10,0,0,0,0,0,0,0,0,null,{"$f":"1*O40+2*P40+3*Q40+4*R40","v":0},{"$f":"4*O40+3*P40+2*Q40+1*R40","v":0},null,0]
[{"$f":"Programmes!C25","v":24},{"$f":"Programmes!B25","v":"Reconnaitre et utiliser les notions d’alignement, d’angle droit, d’égalité de longueurs, de milieu…"},null,{"$f":"IF(O41>0,K41/O41,\"\")","v":""},"","","",{"$f":"IF(W41>0,SUM(K41:N41)&\"/\"&W41,\"\")","v":""},{"$f":"IF(SUM(O41:R41)>0,ROUND(SUM(K41:N41)/SUM(O41:R41),2),\"\")","v":""},11,0,0,0,0,0,0,0,0,null,{"$f":"1*O41+2*P41+3*Q41+4*R41","v":0},{"$f":"4*O41+3*P41+2*Q41+1*R41","v":0},null,0]
[]
[null,"LES ABSENCES DE RÉPONSE",null,"Par niveau de difficulté",null,null,null,"Total"]
[null,"Sur l'ensemble des items de l'évaluation",null,{"$f":"IF((Saisie!AR35+Saisie!AR37)>0,Saisie!AR37/Saisie!QJ35,\"\")","v":""},{"$f":"IF((Saisie!AS35+Saisie!AS37)>0,Saisie!AS37/Saisie!QK35,\"\")","v":""},{"$f":"IF((Saisie!AT35+Saisie!AT37)>0,Saisie!AT37/Saisie!QL35,\"\")","v":""},{"$f":"IF((Saisie!AU35+Saisie!AU37)>0,Saisie!AU37/Saisie!QM35,\"\")","v":""},{"$f":"IF((SUM(Saisie!AR35:AU35)+SUM(Saisie!AR37:AU37))>0,SUM(Saisie!AR37:AU37)&\"/\"&SUM(Saisie!QJ35:QM35),\"\")","v":""},{"$f":"IF((SUM(Saisie!AR35:AU35)+SUM(Saisie!AR37:AU37))>0,SUM(Saisie!AR37:AU37)/SUM(Saisie!QJ35:QM35),\"\")","v":""}]
[]
[]
[]
[]
[{"$f":"Informations!$A$14","v":" : "},null,null,null,null,null,{"$f":"Informations!$B$14","v":" : "}]
[{"$f":"Informations!$A$15","v":""},null,null,null,null,null,{"$f":"Informations!$B$15","v":""}]
[{"$f":"IF(ISBLANK(A$1),\"\",A$1)","v":" "},null,null,null,null,null,"CE2"]
[]
["BILAN DE L'ÉVALUATION DIAGNOSTIQUE"]
[]
["#","LES ACQUIS LES PLUS SÛRS",null,"Par niveau de difficulté",null,null,null,"Total"]
[{"$f":"IF(B56=\"\",\"\",VLOOKUP(B56,matrice_des_programmes,2,0))","v":1},{"$f":"IF('Réussites - élève'!F7>=0.75,'Réussites - élève'!B7,\"\")","v":"Conserver une attention soutenue et manifester, si besoin et à bon escient, son incompréhension."},null,{"$f":"IF(B56=\"\",\"\",VLOOKUP(A56,matrice_du_bilan,4,0))","v":""},{"$f":"IF(B56=\"\",\"\",VLOOKUP(A56,matrice_du_bilan,5,0))","v":""},{"$f":"IF(B56=\"\",\"\",VLOOKUP(A56,matrice_du_bilan,6,0))","v":""},{"$f":"IF(B56=\"\",\"\",VLOOKUP(A56,matrice_du_bilan,7,0))","v":""},{"$f":"IF(B56=\"\",\"\",VLOOKUP(A56,matrice_du_bilan,8,0))","v":""},{"$f":"IF(B56=\"\",\"\",VLOOKUP(A56,matrice_du_bilan,9,0))","v":""}]
[{"$f":"IF(B57=\"\",\"\",VLOOKUP(B57,matrice_des_programmes,2,0))","v":6},{"$f":"IF('Réussites - élève'!F8>=0.75,'Réussites - élève'!B8,\"\")","v":"Lire et comprendre des textes adaptés à la maturité et à la culture scolaire des élèves."},null,{"$f":"IF(B57=\"\",\"\",VLOOKUP(A57,matrice_du_bilan,4,0))","v":""},{"$f":"IF(B57=\"\",\"\",VLOOKUP(A57,matrice_du_bilan,5,0))","v":""},{"$f":"IF(B57=\"\",\"\",VLOOKUP(A57,matrice_du_bilan,6,0))","v":""},{"$f":"IF(B57=\"\",\"\",VLOOKUP(A57,matrice_du_bilan,7,0))","v":""},{"$f":"IF(B57=\"\",\"\",VLOOKUP(A57,matrice_du_bilan,8,0))","v":""},{"$f":"IF(B57=\"\",\"\",VLOOKUP(A57,matrice_du_bilan,9,0))","v":""}]
[{"$f":"IF(B58=\"\",\"\",VLOOKUP(B58,matrice_des_programmes,2,0))","v":7},{"$f":"IF('Réussites - élève'!F9>=0.75,'Réussites - élève'!B9,\"\")","v":"Lire à voix haute avec fluidité, après préparation, un texte d’une demi-page."},null,{"$f":"IF(B58=\"\",\"\",VLOOKUP(A58,matrice_du_bilan,4,0))","v":""},{"$f":"IF(B58=\"\",\"\",VLOOKUP(A58,matrice_du_bilan,5,0))","v":""},{"$f":"IF(B58=\"\",\"\",VLOOKUP(A58,matrice_du_bilan,6,0))","v":""},{"$f":"IF(B58=\"\",\"\",VLOOKUP(A58,matrice_du_bilan,7,0))","v":""},{"$f":"IF(B58=\"\",\"\",VLOOKUP(A58,matrice_du_bilan,8,0))","v":""},{"$f":"IF(B58=\"\",\"\",VLOOKUP(A58,matrice_du_bilan,9,0))","v":""}]
[{"$f":"IF(B59=\"\",\"\",VLOOKUP(B59,matrice_des_programmes,2,0))","v":8},{"$f":"IF('Réussites - élève'!F10>=0.75,'Réussites - élève'!B10,\"\")","v":"Copier ou transcrire, dans une écriture lisible, un texte d’une dizaine de lignes."},null,{"$f":"IF(B59=\"\",\"\",VLOOKUP(A59,matrice_du_bilan,4,0))","v":""},{"$f":"IF(B59=\"\",\"\",VLOOKUP(A59,matrice_du_bilan,5,0))","v":""},{"$f":"IF(B59=\"\",\"\",VLOOKUP(A59,matrice_du_bilan,6,0))","v":""},{"$f":"IF(B59=\"\",\"\",VLOOKUP(A59,matrice_du_bilan,7,0))","v":""},{"$f":"IF(B59=\"\",\"\",VLOOKUP(A59,matrice_du_bilan,8,0))","v":""},{"$f":"IF(B59=\"\",\"\",VLOOKUP(A59,matrice_du_bilan,9,0))","v":""}]
[{"$f":"IF(B60=\"\",\"\",VLOOKUP(B60,matrice_des_programmes,2,0))","v":9},{"$f":"IF('Réussites - élève'!F11>=0.75,'Réussites - élève'!B11,\"\")","v":"Rédiger un texte d’environ une demi-page, cohérent, organisé, ponctué, pertinent."},null,{"$f":"IF(B60=\"\",\"\",VLOOKUP(A60,matrice_du_bilan,4,0))","v":""},{"$f":"IF(B60=\"\",\"\",VLOOKUP(A60,matrice_du_bilan,5,0))","v":""},{"$f":"IF(B60=\"\",\"\",VLOOKUP(A60,matrice_du_bilan,6,0))","v":""},{"$f":"IF(B60=\"\",\"\",VLOOKUP(A60,matrice_du_bilan,7,0))","v":""},{"$f":"IF(B60=\"\",\"\",VLOOKUP(A60,matrice_du_bilan,8,0))","v":""},{"$f":"IF(B60=\"\",\"\",VLOOKUP(A60,matrice_du_bilan,9,0))","v":""}]
[]
["#","CE QU'IL FAUT TRAVAILLER",null,"Par niveau de difficulté",null,null,null,"Total"]
[{"$f":"IF(B63=\"\",\"\",VLOOKUP(B63,matrice_des_programmes,2,0))","v":""},{"$f":"IF('Difficultés - élève'!G7<0.75,'Difficultés - élève'!B7,\"\")","v":""},null,{"$f":"IF(B63=\"\",\"\",VLOOKUP(A63,matrice_du_bilan,4,0))","v":""},{"$f":"IF(B63=\"\",\"\",VLOOKUP(A63,matrice_du_bilan,5,0))","v":""},{"$f":"IF(B63=\"\",\"\",VLOOKUP(A63,matrice_du_bilan,6,0))","v":""},{"$f":"IF(B63=\"\",\"\",VLOOKUP(A63,matrice_du_bilan,7,0))","v":""},{"$f":"IF(B63=\"\",\"\",VLOOKUP(A63,matrice_du_bilan,8,0))","v":""},{"$f":"IF(B63=\"\",\"\",VLOOKUP(A63,matrice_du_bilan,9,0))","v":""}]
[{"$f":"IF(B64=\"\",\"\",VLOOKUP(B64,matrice_des_programmes,2,0))","v":""},{"$f":"IF('Difficultés - élève'!G8<0.75,'Difficultés - élève'!B8,\"\")","v":""},null,{"$f":"IF(B64=\"\",\"\",VLOOKUP(A64,matrice_du_bilan,4,0))","v":""},{"$f":"IF(B64=\"\",\"\",VLOOKUP(A64,matrice_du_bilan,5,0))","v":""},{"$f":"IF(B64=\"\",\"\",VLOOKUP(A64,matrice_du_bilan,6,0))","v":""},{"$f":"IF(B64=\"\",\"\",VLOOKUP(A64,matrice_du_bilan,7,0))","v":""},{"$f":"IF(B64=\"\",\"\",VLOOKUP(A64,matrice_du_bilan,8,0))","v":""},{"$f":"IF(B64=\"\",\"\",VLOOKUP(A64,matrice_du_bilan,9,0))","v":""}]
[{"$f":"IF(B65=\"\",\"\",VLOOKUP(B65,matrice_des_programmes,2,0))","v":""},{"$f":"IF('Difficultés - élève'!G9<0.75,'Difficultés - élève'!B9,\"\")","v":""},null,{"$f":"IF(B65=\"\",\"\",VLOOKUP(A65,matrice_du_bilan,4,0))","v":""},{"$f":"IF(B65=\"\",\"\",VLOOKUP(A65,matrice_du_bilan,5,0))","v":""},{"$f":"IF(B65=\"\",\"\",VLOOKUP(A65,matrice_du_bilan,6,0))","v":""},{"$f":"IF(B65=\"\",\"\",VLOOKUP(A65,matrice_du_bilan,7,0))","v":""},{"$f":"IF(B65=\"\",\"\",VLOOKUP(A65,matrice_du_bilan,8,0))","v":""},{"$f":"IF(B65=\"\",\"\",VLOOKUP(A65,matrice_du_bilan,9,0))","v":""}]
[{"$f":"IF(B66=\"\",\"\",VLOOKUP(B66,matrice_des_programmes,2,0))","v":""},{"$f":"IF('Difficultés - élève'!G10<0.75,'Difficultés - élève'!B10,\"\")","v":""},null,{"$f":"IF(B66=\"\",\"\",VLOOKUP(A66,matrice_du_bilan,4,0))","v":""},{"$f":"IF(B66=\"\",\"\",VLOOKUP(A66,matrice_du_bilan,5,0))","v":""},{"$f":"IF(B66=\"\",\"\",VLOOKUP(A66,matrice_du_bilan,6,0))","v":""},{"$f":"IF(B66=\"\",\"\",VLOOKUP(A66,matrice_du_bilan,7,0))","v":""},{"$f":"IF(B66=\"\",\"\",VLOOKUP(A66,matrice_du_bilan,8,0))","v":""},{"$f":"IF(B66=\"\",\"\",VLOOKUP(A66,matrice_du_bilan,9,0))","v":""}]
[{"$f":"IF(B67=\"\",\"\",VLOOKUP(B67,matrice_des_programmes,2,0))","v":""},{"$f":"IF('Difficultés - élève'!G11<0.75,'Difficultés - élève'!B11,\"\")","v":""},null,{"$f":"IF(B67=\"\",\"\",VLOOKUP(A67,matrice_du_bilan,4,0))","v":""},{"$f":"IF(B67=\"\",\"\",VLOOKUP(A67,matrice_du_bilan,5,0))","v":""},{"$f":"IF(B67=\"\",\"\",VLOOKUP(A67,matrice_du_bilan,6,0))","v":""},{"$f":"IF(B67=\"\",\"\",VLOOKUP(A67,matrice_du_bilan,7,0))","v":""},{"$f":"IF(B67=\"\",\"\",VLOOKUP(A67,matrice_du_bilan,8,0))","v":""},{"$f":"IF(B67=\"\",\"\",VLOOKUP(A67,matrice_du_bilan,9,0))","v":""}]
[]
["Légende"]
[]
[null,null,"Objectifs d'apprentissage non atteints",0]
[null,null,"Objectifs d'apprentissage partiellement atteints",50]
[null,null,"Objectifs d'apprentissage atteints ou dépassés",75]
[]
["Information sur les niveaux de difficulté"]
[]
[null,null,null,"Par niveau de difficulté",null,null,null,"Attendu"]
[null,null,null,1,2,3,4]
[null,"Acquis de base",null,1,null,null,null,"Oui"]
[null,"Acquis approfondis",null,null,1,null,null,"Oui"]
[null,"Acquis remarquables",null,null,null,1,null,"Non"]
[null,"Acquis experts",null,null,null,null,1,"Non"]
[]
["Les acquis de niveau 3 et 4 ne sont pas attendus à l'entrée du CE2. Les résultats doivent être analysés au regard des niveaux de difficulté des exercices."]
[]
[]
[null,"L'ÉQUIPE PÉDAGOGIQUE",null,"SIGNATURE DES PARENTS"]
[]
[]
[]
[{"$f":"Informations!$A$14","v":" : "},null,null,null,null,null,{"$f":"Informations!$B$14","v":" : "}]
[{"$f":"Informations!$A$15","v":""},null,null,null,null,null,{"$f":"Informations!$B$15","v":""}]

{"sheet":"Difficultés - élève","index":6,"n_rows":36,"n_cols":17,"rows_kept":36,"cut":false,"hidden":true,"merged":[[0,0,0,6],[1,0,1,6],[2,0,2,6],[27,0,27,6],[5,1,5,4]]}
["DIFFICULTÉS AUX ATTENDUS"]
[{"$f":"'Bilan - élève'!A1","v":" "}]
["Évaluation diagnostique d'entrée en CE2"]
[]
[]
[null,"Compétences",null,null,null,"Niv.","¡",null,null,"Facilité 2","Numéro 1","Numéro 2","Facilité 1","Numéro 1","Numéro 2"]
[1,{"$f":"VLOOKUP(G7,H$7:I$26,2,0)","v":"Conserver une attention soutenue et manifester, si besoin et à bon escient, son incompréhension."},null,null,null,{"$f":"VLOOKUP(B7,matrice_des_programmes,3,0)","v":0},{"$f":"IF(ROW(G7)-6>COUNT(H$7:H$26),\"\",SMALL(H$7:H$26,ROW(G7)-6))","v":""},{"$f":"VLOOKUP(I7,P$7:Q$26,2,0)","v":""},{"$f":"VLOOKUP(J7,M$7:P$26,4,0)","v":"Conserver une attention soutenue et manifester, si besoin et à bon escient, son incompréhension."},{"$f":"IF(ROW(J7)-6>COUNT(M$7:M$26),\"\",LARGE(M$7:M$26,ROW(J7)-6))","v":0},1,{"$f":"VLOOKUP(G7,H$7:K$26,4,0)","v":1},{"$f":"'Bilan - élève'!U10","v":0},1,{"$f":"VLOOKUP(J7,M$7:N$26,2,0)","v":1},{"$f":"Programmes!$B2","v":"Conserver une attention soutenue et manifester, si besoin et à bon escient, son incompréhension."},{"$f":"'Bilan - élève'!I10","v":""}]
[{"$f":"IF(ISTEXT(B8),A7+1,\"\")","v":2},{"$f":"IF(G8=G7,VLOOKUP(G8,OFFSET(H$7,L7,0,1,1):I$26,2,0),VLOOKUP(G8,H$7:I$26,2,0))","v":"Lire et comprendre des textes adaptés à la maturité et à la culture scolaire des élèves."},null,null,null,0,{"$f":"IF(ROW(G8)-6>COUNT(H$7:H$26),\"\",SMALL(H$7:H$26,ROW(G8)-6))","v":""},{"$f":"VLOOKUP(I8,P$7:Q$26,2,0)","v":""},{"$f":"IF(J8=J7,VLOOKUP(J8,OFFSET(M$7,O7,0,1,1):P$26,4,0),VLOOKUP(J8,M$7:P$26,4,0))","v":"Lire et comprendre des textes adaptés à la maturité et à la culture scolaire des élèves."},{"$f":"IF(ROW(J8)-6>COUNT(M$7:M$26),\"\",LARGE(M$7:M$26,ROW(J8)-6))","v":0},2,{"$f":"IF(G8=G7,VLOOKUP(G8,OFFSET(H$7,L7,0,1,1):K$26,4,0),VLOOKUP(G8,H$7:K$26,4,0))","v":2},{"$f":"'Bilan - élève'!U16","v":0},2,{"$f":"IF(J8=J7,VLOOKUP(J8,OFFSET(M$7,O7,0,1,1):N$26,2,0),VLOOKUP(J8,M$7:N$26,2,0))","v":2},{"$f":"Programmes!$B7","v":"Lire et comprendre des textes adaptés à la maturité et à la culture scolaire des élèves."},{"$f":"'Bilan - élève'!I16","v":""}]
[{"$f":"IF(ISTEXT(B9),A8+1,\"\")","v":3},{"$f":"IF(G9=G8,VLOOKUP(G9,OFFSET(H$7,L8,0,1,1):I$26,2,0),VLOOKUP(G9,H$7:I$26,2,0))","v":"Lire à voix haute avec fluidité, après préparation, un texte d’une demi-page."},null,null,null,{"$f":"VLOOKUP(B9,matrice_des_programmes,3,0)","v":0},{"$f":"IF(ROW(G9)-6>COUNT(H$7:H$26),\"\",SMALL(H$7:H$26,ROW(G9)-6))","v":""},{"$f":"VLOOKUP(I9,P$7:Q$26,2,0)","v":""},{"$f":"IF(J9=J8,VLOOKUP(J9,OFFSET(M$7,O8,0,1,1):P$26,4,0),VLOOKUP(J9,M$7:P$26,4,0))","v":"Lire à voix haute avec fluidité, après préparation, un texte d’une demi-page."},{"$f":"IF(ROW(J9)-6>COUNT(M$7:M$26),\"\",LARGE(M$7:M$26,ROW(J9)-6))","v":0},3,{"$f":"IF(G9=G8,VLOOKUP(G9,OFFSET(H$7,L8,0,1,1):K$26,4,0),VLOOKUP(G9,H$7:K$26,4,0))","v":3},{"$f":"'Bilan - élève'!U17","v":0},3,{"$f":"IF(J9=J8,VLOOKUP(J9,OFFSET(M$7,O8,0,1,1):N$26,2,0),VLOOKUP(J9,M$7:N$26,2,0))","v":3},{"$f":"Programmes!$B8","v":"Lire à voix haute avec fluidité, après préparation, un texte d’une demi-page."},{"$f":"'Bilan - élève'!I17","v":""}]
[4,{"$f":"IF(G10=G9,VLOOKUP(G10,OFFSET(H$7,L9,0,1,1):I$26,2,0),VLOOKUP(G10,H$7:I$26,2,0))","v":"Copier ou transcrire, dans une écriture lisible, un texte d’une dizaine de lignes."},null,null,null,0,"","",{"$f":"IF(J10=J9,VLOOKUP(J10,OFFSET(M$7,O9,0,1,1):P$26,4,0),VLOOKUP(J10,M$7:P$26,4,0))","v":"Copier ou transcrire, dans une écriture lisible, un texte d’une dizaine de lignes."},0,4,{"$f":"IF(G10=G9,VLOOKUP(G10,OFFSET(H$7,L9,0,1,1):K$26,4,0),VLOOKUP(G10,H$7:K$26,4,0))","v":4},{"$f":"'Bilan - élève'!U18","v":0},4,{"$f":"IF(J10=J9,VLOOKUP(J10,OFFSET(M$7,O9,0,1,1):N$26,2,0),VLOOKUP(J10,M$7:N$26,2,0))","v":4},{"$f":"Programmes!$B9","v":"Copier ou transcrire, dans une écriture lisible, un texte d’une dizaine de lignes."},{"$f":"'Bilan - élève'!I19","v":""}]
[5,{"$f":"IF(G11=G10,VLOOKUP(G11,OFFSET(H$7,L10,0,1,1):I$26,2,0),VLOOKUP(G11,H$7:I$26,2,0))","v":"Rédiger un texte d’environ une demi-page, cohérent, organisé, ponctué, pertinent."},null,null,null,0,"","",{"$f":"IF(J11=J10,VLOOKUP(J11,OFFSET(M$7,O10,0,1,1):P$26,4,0),VLOOKUP(J11,M$7:P$26,4,0))","v":"Rédiger un texte d’environ une demi-page, cohérent, organisé, ponctué, pertinent."},0,5,{"$f":"IF(G11=G10,VLOOKUP(G11,OFFSET(H$7,L10,0,1,1):K$26,4,0),VLOOKUP(G11,H$7:K$26,4,0))","v":5},{"$f":"'Bilan - élève'!U19","v":0},5,{"$f":"IF(J11=J10,VLOOKUP(J11,OFFSET(M$7,O10,0,1,1):N$26,2,0),VLOOKUP(J11,M$7:N$26,2,0))","v":5},{"$f":"Programmes!$B10","v":"Rédiger un texte d’environ une demi-page, cohérent, organisé, ponctué, pertinent."},{"$f":"'Bilan - élève'!I20","v":""}]
[6,{"$f":"IF(G12=G11,VLOOKUP(G12,OFFSET(H$7,L11,0,1,1):I$26,2,0),VLOOKUP(G12,H$7:I$26,2,0))","v":"Améliorer une production, notamment l’orthographe, en tenant compte d’indications."},null,null,null,0,"","",{"$f":"IF(J12=J11,VLOOKUP(J12,OFFSET(M$7,O11,0,1,1):P$26,4,0),VLOOKUP(J12,M$7:P$26,4,0))","v":"Améliorer une production, notamment l’orthographe, en tenant compte d’indications."},0,6,{"$f":"IF(G12=G11,VLOOKUP(G12,OFFSET(H$7,L11,0,1,1):K$26,4,0),VLOOKUP(G12,H$7:K$26,4,0))","v":6},{"$f":"'Bilan - élève'!U20","v":0},6,{"$f":"IF(J12=J11,VLOOKUP(J12,OFFSET(M$7,O11,0,1,1):N$26,2,0),VLOOKUP(J12,M$7:N$26,2,0))","v":6},{"$f":"Programmes!$B11","v":"Améliorer une production, notamment l’orthographe, en tenant compte d’indications."},{"$f":"'Bilan - élève'!I21","v":""}]
[7,{"$f":"IF(G13=G12,VLOOKUP(G13,OFFSET(H$7,L12,0,1,1):I$26,2,0),VLOOKUP(G13,H$7:I$26,2,0))","v":"Orthographier les mots les plus fréquents et les mots invariables mémorisés."},null,null,null,0,"","",{"$f":"IF(J13=J12,VLOOKUP(J13,OFFSET(M$7,O12,0,1,1):P$26,4,0),VLOOKUP(J13,M$7:P$26,4,0))","v":"Orthographier les mots les plus fréquents et les mots invariables mémorisés."},0,7,{"$f":"IF(G13=G12,VLOOKUP(G13,OFFSET(H$7,L12,0,1,1):K$26,4,0),VLOOKUP(G13,H$7:K$26,4,0))","v":7},{"$f":"'Bilan - élève'!U21","v":0},7,{"$f":"IF(J13=J12,VLOOKUP(J13,OFFSET(M$7,O12,0,1,1):N$26,2,0),VLOOKUP(J13,M$7:N$26,2,0))","v":7},{"$f":"Programmes!$B12","v":"Orthographier les mots les plus fréquents et les mots invariables mémorisés."},{"$f":"'Bilan - élève'!I23","v":""}]
[8,{"$f":"IF(G14=G13,VLOOKUP(G14,OFFSET(H$7,L13,0,1,1):I$26,2,0),VLOOKUP(G14,H$7:I$26,2,0))","v":"Raisonner pour réaliser les accords dans le groupe nominal et entre le verbe et son sujet."},null,null,null,0,"","",{"$f":"IF(J14=J13,VLOOKUP(J14,OFFSET(M$7,O13,0,1,1):P$26,4,0),VLOOKUP(J14,M$7:P$26,4,0))","v":"Raisonner pour réaliser les accords dans le groupe nominal et entre le verbe et son sujet."},0,8,{"$f":"IF(G14=G13,VLOOKUP(G14,OFFSET(H$7,L13,0,1,1):K$26,4,0),VLOOKUP(G14,H$7:K$26,4,0))","v":8},{"$f":"'Bilan - élève'!U22","v":0},8,{"$f":"IF(J14=J13,VLOOKUP(J14,OFFSET(M$7,O13,0,1,1):N$26,2,0),VLOOKUP(J14,M$7:N$26,2,0))","v":8},{"$f":"Programmes!$B13","v":"Raisonner pour réaliser les accords dans le groupe nominal et entre le verbe et son sujet."},{"$f":"'Bilan - élève'!I24","v":""}]
[9,{"$f":"IF(G15=G14,VLOOKUP(G15,OFFSET(H$7,L14,0,1,1):I$26,2,0),VLOOKUP(G15,H$7:I$26,2,0))","v":"Utiliser ses connaissances sur la langue. "},null,null,null,0,"","",{"$f":"IF(J15=J14,VLOOKUP(J15,OFFSET(M$7,O14,0,1,1):P$26,4,0),VLOOKUP(J15,M$7:P$26,4,0))","v":"Utiliser ses connaissances sur la langue. "},0,9,{"$f":"IF(G15=G14,VLOOKUP(G15,OFFSET(H$7,L14,0,1,1):K$26,4,0),VLOOKUP(G15,H$7:K$26,4,0))","v":9},{"$f":"'Bilan - élève'!U23","v":0},9,{"$f":"IF(J15=J14,VLOOKUP(J15,OFFSET(M$7,O14,0,1,1):N$26,2,0),VLOOKUP(J15,M$7:N$26,2,0))","v":9},{"$f":"Programmes!$B14","v":"Utiliser ses connaissances sur la langue. "},{"$f":"'Bilan - élève'!I25","v":""}]
[10,{"$f":"IF(G16=G15,VLOOKUP(G16,OFFSET(H$7,L15,0,1,1):I$26,2,0),VLOOKUP(G16,H$7:I$26,2,0))","v":"Comprendre et utiliser des nombres entiers pour dénombrer, ordonner, repérer, comparer."},null,null,null,0,"","",{"$f":"IF(J16=J15,VLOOKUP(J16,OFFSET(M$7,O15,0,1,1):P$26,4,0),VLOOKUP(J16,M$7:P$26,4,0))","v":"Comprendre et utiliser des nombres entiers pour dénombrer, ordonner, repérer, comparer."},0,10,{"$f":"IF(G16=G15,VLOOKUP(G16,OFFSET(H$7,L15,0,1,1):K$26,4,0),VLOOKUP(G16,H$7:K$26,4,0))","v":10},{"$f":"'Bilan - élève'!U24","v":0},10,{"$f":"IF(J16=J15,VLOOKUP(J16,OFFSET(M$7,O15,0,1,1):N$26,2,0),VLOOKUP(J16,M$7:N$26,2,0))","v":10},{"$f":"Programmes!$B15","v":"Comprendre et utiliser des nombres entiers pour dénombrer, ordonner, repérer, comparer."},{"$f":"'Bilan - élève'!I29","v":""}]
[11,{"$f":"IF(G17=G16,VLOOKUP(G17,OFFSET(H$7,L16,0,1,1):I$26,2,0),VLOOKUP(G17,H$7:I$26,2,0))","v":"Nommer, lire, écrire, représenter des nombres entiers."},null,null,null,0,"","",{"$f":"IF(J17=J16,VLOOKUP(J17,OFFSET(M$7,O16,0,1,1):P$26,4,0),VLOOKUP(J17,M$7:P$26,4,0))","v":"Nommer, lire, écrire, représenter des nombres entiers."},0,11,{"$f":"IF(G17=G16,VLOOKUP(G17,OFFSET(H$7,L16,0,1,1):K$26,4,0),VLOOKUP(G17,H$7:K$26,4,0))","v":11},{"$f":"'Bilan - élève'!U25","v":0},11,{"$f":"IF(J17=J16,VLOOKUP(J17,OFFSET(M$7,O16,0,1,1):N$26,2,0),VLOOKUP(J17,M$7:N$26,2,0))","v":11},{"$f":"Programmes!$B16","v":"Nommer, lire, écrire, représenter des nombres entiers."},{"$f":"'Bilan - élève'!I30","v":""}]
[12,{"$f":"IF(G18=G17,VLOOKUP(G18,OFFSET(H$7,L17,0,1,1):I$26,2,0),VLOOKUP(G18,H$7:I$26,2,0))","v":"Résoudre des problèmes en utilisant des nombres entiers et le calcul."},null,null,null,0,"","",{"$f":"IF(J18=J17,VLOOKUP(J18,OFFSET(M$7,O17,0,1,1):P$26,4,0),VLOOKUP(J18,M$7:P$26,4,0))","v":"Résoudre des problèmes en utilisant des nombres entiers et le calcul."},0,12,{"$f":"IF(G18=G17,VLOOKUP(G18,OFFSET(H$7,L17,0,1,1):K$26,4,0),VLOOKUP(G18,H$7:K$26,4,0))","v":12},{"$f":"'Bilan - élève'!U26","v":0},12,{"$f":"IF(J18=J17,VLOOKUP(J18,OFFSET(M$7,O17,0,1,1):N$26,2,0),VLOOKUP(J18,M$7:N$26,2,0))","v":12},{"$f":"Programmes!$B17","v":"Résoudre des problèmes en utilisant des nombres entiers et le calcul."},{"$f":"'Bilan - élève'!I31","v":""}]
[13,{"$f":"IF(G19=G18,VLOOKUP(G19,OFFSET(H$7,L18,0,1,1):I$26,2,0),VLOOKUP(G19,H$7:I$26,2,0))","v":"Calculer avec des nombres entiers."},null,null,null,0,"","",{"$f":"IF(J19=J18,VLOOKUP(J19,OFFSET(M$7,O18,0,1,1):P$26,4,0),VLOOKUP(J19,M$7:P$26,4,0))","v":"Calculer avec des nombres entiers."},0,13,{"$f":"IF(G19=G18,VLOOKUP(G19,OFFSET(H$7,L18,0,1,1):K$26,4,0),VLOOKUP(G19,H$7:K$26,4,0))","v":13},{"$f":"'Bilan - élève'!U27","v":0},13,{"$f":"IF(J19=J18,VLOOKUP(J19,OFFSET(M$7,O18,0,1,1):N$26,2,0),VLOOKUP(J19,M$7:N$26,2,0))","v":13},{"$f":"Programmes!$B18","v":"Calculer avec des nombres entiers."},{"$f":"'Bilan - élève'!I32","v":""}]
[14,{"$f":"IF(G20=G19,VLOOKUP(G20,OFFSET(H$7,L19,0,1,1):I$26,2,0),VLOOKUP(G20,H$7:I$26,2,0))","v":"Comparer, estimer, mesurer des longueurs, des masses, des contenances, des durées."},null,null,null,0,"","",{"$f":"IF(J20=J19,VLOOKUP(J20,OFFSET(M$7,O19,0,1,1):P$26,4,0),VLOOKUP(J20,M$7:P$26,4,0))","v":"Comparer, estimer, mesurer des longueurs, des masses, des contenances, des durées."},0,14,{"$f":"IF(G20=G19,VLOOKUP(G20,OFFSET(H$7,L19,0,1,1):K$26,4,0),VLOOKUP(G20,H$7:K$26,4,0))","v":14},{"$f":"'Bilan - élève'!U28","v":0},14,{"$f":"IF(J20=J19,VLOOKUP(J20,OFFSET(M$7,O19,0,1,1):N$26,2,0),VLOOKUP(J20,M$7:N$26,2,0))","v":14},{"$f":"Programmes!$B19","v":"Comparer, estimer, mesurer des longueurs, des masses, des contenances, des durées."},{"$f":"'Bilan - élève'!I34","v":""}]
[15,{"$f":"IF(G21=G20,VLOOKUP(G21,OFFSET(H$7,L20,0,1,1):I$26,2,0),VLOOKUP(G21,H$7:I$26,2,0))","v":"Utiliser le lexique, les unités, les instruments de mesures spécifiques de ces grandeurs."},null,null,null,0,"","",{"$f":"IF(J21=J20,VLOOKUP(J21,OFFSET(M$7,O20,0,1,1):P$26,4,0),VLOOKUP(J21,M$7:P$26,4,0))","v":"Utiliser le lexique, les unités, les instruments de mesures spécifiques de ces grandeurs."},0,15,{"$f":"IF(G21=G20,VLOOKUP(G21,OFFSET(H$7,L20,0,1,1):K$26,4,0),VLOOKUP(G21,H$7:K$26,4,0))","v":15},{"$f":"'Bilan - élève'!U29","v":0},15,{"$f":"IF(J21=J20,VLOOKUP(J21,OFFSET(M$7,O20,0,1,1):N$26,2,0),VLOOKUP(J21,M$7:N$26,2,0))","v":15},{"$f":"Programmes!$B20","v":"Utiliser le lexique, les unités, les instruments de mesures spécifiques de ces grandeurs."},{"$f":"'Bilan - élève'!I35","v":""}]
[16,{"$f":"IF(G22=G21,VLOOKUP(G22,OFFSET(H$7,L21,0,1,1):I$26,2,0),VLOOKUP(G22,H$7:I$26,2,0))","v":"Résoudre des problèmes impliquant des longueurs, des masses, des contenances, des durées…"},null,null,null,0,"","",{"$f":"IF(J22=J21,VLOOKUP(J22,OFFSET(M$7,O21,0,1,1):P$26,4,0),VLOOKUP(J22,M$7:P$26,4,0))","v":"Résoudre des problèmes impliquant des longueurs, des masses, des contenances, des durées…"},0,16,{"$f":"IF(G22=G21,VLOOKUP(G22,OFFSET(H$7,L21,0,1,1):K$26,4,0),VLOOKUP(G22,H$7:K$26,4,0))","v":16},{"$f":"'Bilan - élève'!U30","v":0},16,{"$f":"IF(J22=J21,VLOOKUP(J22,OFFSET(M$7,O21,0,1,1):N$26,2,0),VLOOKUP(J22,M$7:N$26,2,0))","v":16},{"$f":"Programmes!$B21","v":"Résoudre des problèmes impliquant des longueurs, des masses, des contenances, des durées…"},{"$f":"'Bilan - élève'!I36","v":""}]
[17,{"$f":"IF(G23=G22,VLOOKUP(G23,OFFSET(H$7,L22,0,1,1):I$26,2,0),VLOOKUP(G23,H$7:I$26,2,0))","v":"(Se) repérer et (se) déplacer en utilisant des repères et des représentations."},null,null,null,0,"","",{"$f":"IF(J23=J22,VLOOKUP(J23,OFFSET(M$7,O22,0,1,1):P$26,4,0),VLOOKUP(J23,M$7:P$26,4,0))","v":"(Se) repérer et (se) déplacer en utilisant des repères et des représentations."},0,17,{"$f":"IF(G23=G22,VLOOKUP(G23,OFFSET(H$7,L22,0,1,1):K$26,4,0),VLOOKUP(G23,H$7:K$26,4,0))","v":17},{"$f":"'Bilan - élève'!U31","v":0},17,{"$f":"IF(J23=J22,VLOOKUP(J23,OFFSET(M$7,O22,0,1,1):N$26,2,0),VLOOKUP(J23,M$7:N$26,2,0))","v":17},{"$f":"Programmes!$B22","v":"(Se) repérer et (se) déplacer en utilisant des repères et des représentations."},{"$f":"'Bilan - élève'!I38","v":""}]
[18,{"$f":"IF(G24=G23,VLOOKUP(G24,OFFSET(H$7,L23,0,1,1):I$26,2,0),VLOOKUP(G24,H$7:I$26,2,0))","v":"Reconnaitre, nommer, décrire, reproduire quelques solides."},null,null,null,0,"","",{"$f":"IF(J24=J23,VLOOKUP(J24,OFFSET(M$7,O23,0,1,1):P$26,4,0),VLOOKUP(J24,M$7:P$26,4,0))","v":"Reconnaitre, nommer, décrire, reproduire quelques solides."},0,18,{"$f":"IF(G24=G23,VLOOKUP(G24,OFFSET(H$7,L23,0,1,1):K$26,4,0),VLOOKUP(G24,H$7:K$26,4,0))","v":18},{"$f":"'Bilan - élève'!U32","v":0},18,{"$f":"IF(J24=J23,VLOOKUP(J24,OFFSET(M$7,O23,0,1,1):N$26,2,0),VLOOKUP(J24,M$7:N$26,2,0))","v":18},{"$f":"Programmes!$B23","v":"Reconnaitre, nommer, décrire, reproduire quelques solides."},{"$f":"'Bilan - élève'!I39","v":""}]
[19,{"$f":"IF(G25=G24,VLOOKUP(G25,OFFSET(H$7,L24,0,1,1):I$26,2,0),VLOOKUP(G25,H$7:I$26,2,0))","v":"Reconnaitre, nommer, décrire, reproduire, construire quelques figures géométriques."},null,null,null,0,"","",{"$f":"IF(J25=J24,VLOOKUP(J25,OFFSET(M$7,O24,0,1,1):P$26,4,0),VLOOKUP(J25,M$7:P$26,4,0))","v":"Reconnaitre, nommer, décrire, reproduire, construire quelques figures géométriques."},0,19,{"$f":"IF(G25=G24,VLOOKUP(G25,OFFSET(H$7,L24,0,1,1):K$26,4,0),VLOOKUP(G25,H$7:K$26,4,0))","v":19},{"$f":"'Bilan - élève'!U33","v":0},19,{"$f":"IF(J25=J24,VLOOKUP(J25,OFFSET(M$7,O24,0,1,1):N$26,2,0),VLOOKUP(J25,M$7:N$26,2,0))","v":19},{"$f":"Programmes!$B24","v":"Reconnaitre, nommer, décrire, reproduire, construire quelques figures géométriques."},{"$f":"'Bilan - élève'!I40","v":""}]
[{"$f":"IF(ISTEXT(B26),A25+1,\"\")","v":20},{"$f":"IF(G26=G25,VLOOKUP(G26,OFFSET(H$7,L25,0,1,1):I$26,2,0),VLOOKUP(G26,H$7:I$26,2,0))","v":"Reconnaitre et utiliser les notions d’alignement, d’angle droit, d’égalité de longueurs, de milieu…"},null,null,null,{"$f":"VLOOKUP(B26,matrice_des_programmes,3,0)","v":0},"",{"$f":"VLOOKUP(I26,P$7:Q$26,2,0)","v":""},{"$f":"IF(J26=J25,VLOOKUP(J26,OFFSET(M$7,O25,0,1,1):P$26,4,0),VLOOKUP(J26,M$7:P$26,4,0))","v":"Reconnaitre et utiliser les notions d’alignement, d’angle droit, d’égalité de longueurs, de milieu…"},{"$f":"IF(ROW(J26)-6>COUNT(M$7:M$26),\"\",LARGE(M$7:M$26,ROW(J26)-6))","v":0},20,{"$f":"IF(G26=G25,VLOOKUP(G26,OFFSET(H$7,L25,0,1,1):K$26,4,0),VLOOKUP(G26,H$7:K$26,4,0))","v":20},{"$f":"'Bilan - élève'!U34","v":0},20,{"$f":"IF(J26=J25,VLOOKUP(J26,OFFSET(M$7,O25,0,1,1):N$26,2,0),VLOOKUP(J26,M$7:N$26,2,0))","v":20},{"$f":"Programmes!$B25","v":"Reconnaitre et utiliser les notions d’alignement, d’angle droit, d’égalité de longueurs, de milieu…"},{"$f":"'Bilan - élève'!I41","v":""}]
[]
["Légende"]
[]
[null,null,0,"Taux de réussite inférieur à 50%"]
[null,null,50,"Taux de réussite compris entre 50% et 75%"]
[null,null,75,"Taux de réussite supérieur ou égal à 75%"]
[]
[]
[{"$f":"Informations!$A$14","v":" : "},null,null,null,null,null,{"$f":"Informations!$B$14","v":" : "}]
[{"$f":"Informations!$A$15","v":""},null,null,null,null,null,{"$f":"Informations!$B$2","v":"2016-2017"}]

{"sheet":"Réussites - élève","index":7,"n_rows":36,"n_cols":16,"rows_kept":36,"cut":false,"hidden":false,"merged":[[0,0,0,5],[1,0,1,5],[2,0,2,5],[27,0,27,6],[5,1,5,4]]}
["RÉUSSITES AUX ATTENDUS"]
[{"$f":"'Bilan - élève'!A1","v":" "}]
["Évaluation diagnostique d'entrée en CE2"]
[]
[]
[null,"Compétences",null,null,null,"¡",null,null,"Difficulté 2","Numéro 1","Numéro 2","Difficulté 1","Numéro 1","Numéro 2"]
[1,{"$f":"VLOOKUP(F7,G$7:H$26,2,0)","v":"Conserver une attention soutenue et manifester, si besoin et à bon escient, son incompréhension."},null,null,null,{"$f":"IF(ROW(F7)-6>COUNT(G$7:G$26),\"\",LARGE(G$7:G$26,ROW(F7)-6))","v":""},{"$f":"VLOOKUP(H7,O$7:P$26,2,0)","v":""},{"$f":"VLOOKUP(I7,L$7:O$26,4,0)","v":"Conserver une attention soutenue et manifester, si besoin et à bon escient, son incompréhension."},{"$f":"IF(ROW(I7)-6>COUNT(L$7:L$26),\"\",LARGE(L$7:L$26,ROW(I7)-6))","v":0},1,{"$f":"VLOOKUP(F7,G$7:J$26,4,0)","v":1},{"$f":"'Bilan - élève'!T10","v":0},1,{"$f":"VLOOKUP(I7,L$7:M$26,2,0)","v":1},{"$f":"Programmes!$B2","v":"Conserver une attention soutenue et manifester, si besoin et à bon escient, son incompréhension."},{"$f":"'Bilan - élève'!I10","v":""}]
[{"$f":"IF(ISTEXT(B8),A7+1,\"\")","v":2},{"$f":"IF(F8=F7,VLOOKUP(F8,OFFSET(G$7,K7,0,1,1):H$26,2,0),VLOOKUP(F8,G$7:H$26,2,0))","v":"Lire et comprendre des textes adaptés à la maturité et à la culture scolaire des élèves."},null,null,null,"","",{"$f":"IF(I8=I7,VLOOKUP(I8,OFFSET(L$7,N7,0,1,1):O$26,4,0),VLOOKUP(I8,L$7:O$26,4,0))","v":"Lire et comprendre des textes adaptés à la maturité et à la culture scolaire des élèves."},0,2,{"$f":"IF(F8=F7,VLOOKUP(F8,OFFSET(G$7,K7,0,1,1):J$26,4,0),VLOOKUP(F8,G$7:J$26,4,0))","v":2},{"$f":"'Bilan - élève'!T16","v":0},2,{"$f":"IF(I8=I7,VLOOKUP(I8,OFFSET(L$7,N7,0,1,1):M$26,2,0),VLOOKUP(I8,L$7:M$26,2,0))","v":2},{"$f":"Programmes!$B7","v":"Lire et comprendre des textes adaptés à la maturité et à la culture scolaire des élèves."},{"$f":"'Bilan - élève'!I16","v":""}]
[3,{"$f":"IF(F9=F8,VLOOKUP(F9,OFFSET(G$7,K8,0,1,1):H$26,2,0),VLOOKUP(F9,G$7:H$26,2,0))","v":"Lire à voix haute avec fluidité, après préparation, un texte d’une demi-page."},null,null,null,"","",{"$f":"IF(I9=I8,VLOOKUP(I9,OFFSET(L$7,N8,0,1,1):O$26,4,0),VLOOKUP(I9,L$7:O$26,4,0))","v":"Lire à voix haute avec fluidité, après préparation, un texte d’une demi-page."},0,3,{"$f":"IF(F9=F8,VLOOKUP(F9,OFFSET(G$7,K8,0,1,1):J$26,4,0),VLOOKUP(F9,G$7:J$26,4,0))","v":3},{"$f":"'Bilan - élève'!T17","v":0},3,{"$f":"IF(I9=I8,VLOOKUP(I9,OFFSET(L$7,N8,0,1,1):M$26,2,0),VLOOKUP(I9,L$7:M$26,2,0))","v":3},{"$f":"Programmes!$B8","v":"Lire à voix haute avec fluidité, après préparation, un texte d’une demi-page."},{"$f":"'Bilan - élève'!I17","v":""}]
[4,{"$f":"IF(F10=F9,VLOOKUP(F10,OFFSET(G$7,K9,0,1,1):H$26,2,0),VLOOKUP(F10,G$7:H$26,2,0))","v":"Copier ou transcrire, dans une écriture lisible, un texte d’une dizaine de lignes."},null,null,null,"","",{"$f":"IF(I10=I9,VLOOKUP(I10,OFFSET(L$7,N9,0,1,1):O$26,4,0),VLOOKUP(I10,L$7:O$26,4,0))","v":"Copier ou transcrire, dans une écriture lisible, un texte d’une dizaine de lignes."},0,4,{"$f":"IF(F10=F9,VLOOKUP(F10,OFFSET(G$7,K9,0,1,1):J$26,4,0),VLOOKUP(F10,G$7:J$26,4,0))","v":4},{"$f":"'Bilan - élève'!T18","v":0},4,{"$f":"IF(I10=I9,VLOOKUP(I10,OFFSET(L$7,N9,0,1,1):M$26,2,0),VLOOKUP(I10,L$7:M$26,2,0))","v":4},{"$f":"Programmes!$B9","v":"Copier ou transcrire, dans une écriture lisible, un texte d’une dizaine de lignes."},{"$f":"'Bilan - élève'!I19","v":""}]
[5,{"$f":"IF(F11=F10,VLOOKUP(F11,OFFSET(G$7,K10,0,1,1):H$26,2,0),VLOOKUP(F11,G$7:H$26,2,0))","v":"Rédiger un texte d’environ une demi-page, cohérent, organisé, ponctué, pertinent."},null,null,null,"","",{"$f":"IF(I11=I10,VLOOKUP(I11,OFFSET(L$7,N10,0,1,1):O$26,4,0),VLOOKUP(I11,L$7:O$26,4,0))","v":"Rédiger un texte d’environ une demi-page, cohérent, organisé, ponctué, pertinent."},0,5,{"$f":"IF(F11=F10,VLOOKUP(F11,OFFSET(G$7,K10,0,1,1):J$26,4,0),VLOOKUP(F11,G$7:J$26,4,0))","v":5},{"$f":"'Bilan - élève'!T19","v":0},5,{"$f":"IF(I11=I10,VLOOKUP(I11,OFFSET(L$7,N10,0,1,1):M$26,2,0),VLOOKUP(I11,L$7:M$26,2,0))","v":5},{"$f":"Programmes!$B10","v":"Rédiger un texte d’environ une demi-page, cohérent, organisé, ponctué, pertinent."},{"$f":"'Bilan - élève'!I20","v":""}]
[6,{"$f":"IF(F12=F11,VLOOKUP(F12,OFFSET(G$7,K11,0,1,1):H$26,2,0),VLOOKUP(F12,G$7:H$26,2,0))","v":"Améliorer une production, notamment l’orthographe, en tenant compte d’indications."},null,null,null,"","",{"$f":"IF(I12=I11,VLOOKUP(I12,OFFSET(L$7,N11,0,1,1):O$26,4,0),VLOOKUP(I12,L$7:O$26,4,0))","v":"Améliorer une production, notamment l’orthographe, en tenant compte d’indications."},0,6,{"$f":"IF(F12=F11,VLOOKUP(F12,OFFSET(G$7,K11,0,1,1):J$26,4,0),VLOOKUP(F12,G$7:J$26,4,0))","v":6},{"$f":"'Bilan - élève'!T20","v":0},6,{"$f":"IF(I12=I11,VLOOKUP(I12,OFFSET(L$7,N11,0,1,1):M$26,2,0),VLOOKUP(I12,L$7:M$26,2,0))","v":6},{"$f":"Programmes!$B11","v":"Améliorer une production, notamment l’orthographe, en tenant compte d’indications."},{"$f":"'Bilan - élève'!I21","v":""}]
[7,{"$f":"IF(F13=F12,VLOOKUP(F13,OFFSET(G$7,K12,0,1,1):H$26,2,0),VLOOKUP(F13,G$7:H$26,2,0))","v":"Orthographier les mots les plus fréquents et les mots invariables mémorisés."},null,null,null,"","",{"$f":"IF(I13=I12,VLOOKUP(I13,OFFSET(L$7,N12,0,1,1):O$26,4,0),VLOOKUP(I13,L$7:O$26,4,0))","v":"Orthographier les mots les plus fréquents et les mots invariables mémorisés."},0,7,{"$f":"IF(F13=F12,VLOOKUP(F13,OFFSET(G$7,K12,0,1,1):J$26,4,0),VLOOKUP(F13,G$7:J$26,4,0))","v":7},{"$f":"'Bilan - élève'!T21","v":0},7,{"$f":"IF(I13=I12,VLOOKUP(I13,OFFSET(L$7,N12,0,1,1):M$26,2,0),VLOOKUP(I13,L$7:M$26,2,0))","v":7},{"$f":"Programmes!$B12","v":"Orthographier les mots les plus fréquents et les mots invariables mémorisés."},{"$f":"'Bilan - élève'!I23","v":""}]
[8,{"$f":"IF(F14=F13,VLOOKUP(F14,OFFSET(G$7,K13,0,1,1):H$26,2,0),VLOOKUP(F14,G$7:H$26,2,0))","v":"Raisonner pour réaliser les accords dans le groupe nominal et entre le verbe et son sujet."},null,null,null,"","",{"$f":"IF(I14=I13,VLOOKUP(I14,OFFSET(L$7,N13,0,1,1):O$26,4,0),VLOOKUP(I14,L$7:O$26,4,0))","v":"Raisonner pour réaliser les accords dans le groupe nominal et entre le verbe et son sujet."},0,8,{"$f":"IF(F14=F13,VLOOKUP(F14,OFFSET(G$7,K13,0,1,1):J$26,4,0),VLOOKUP(F14,G$7:J$26,4,0))","v":8},{"$f":"'Bilan - élève'!T22","v":0},8,{"$f":"IF(I14=I13,VLOOKUP(I14,OFFSET(L$7,N13,0,1,1):M$26,2,0),VLOOKUP(I14,L$7:M$26,2,0))","v":8},{"$f":"Programmes!$B13","v":"Raisonner pour réaliser les accords dans le groupe nominal et entre le verbe et son sujet."},{"$f":"'Bilan - élève'!I24","v":""}]
[9,{"$f":"IF(F15=F14,VLOOKUP(F15,OFFSET(G$7,K14,0,1,1):H$26,2,0),VLOOKUP(F15,G$7:H$26,2,0))","v":"Utiliser ses connaissances sur la langue. "},null,null,null,"","",{"$f":"IF(I15=I14,VLOOKUP(I15,OFFSET(L$7,N14,0,1,1):O$26,4,0),VLOOKUP(I15,L$7:O$26,4,0))","v":"Utiliser ses connaissances sur la langue. "},0,9,{"$f":"IF(F15=F14,VLOOKUP(F15,OFFSET(G$7,K14,0,1,1):J$26,4,0),VLOOKUP(F15,G$7:J$26,4,0))","v":9},{"$f":"'Bilan - élève'!T23","v":0},9,{"$f":"IF(I15=I14,VLOOKUP(I15,OFFSET(L$7,N14,0,1,1):M$26,2,0),VLOOKUP(I15,L$7:M$26,2,0))","v":9},{"$f":"Programmes!$B14","v":"Utiliser ses connaissances sur la langue. "},{"$f":"'Bilan - élève'!I25","v":""}]
[10,{"$f":"IF(F16=F15,VLOOKUP(F16,OFFSET(G$7,K15,0,1,1):H$26,2,0),VLOOKUP(F16,G$7:H$26,2,0))","v":"Comprendre et utiliser des nombres entiers pour dénombrer, ordonner, repérer, comparer."},null,null,null,"","",{"$f":"IF(I16=I15,VLOOKUP(I16,OFFSET(L$7,N15,0,1,1):O$26,4,0),VLOOKUP(I16,L$7:O$26,4,0))","v":"Comprendre et utiliser des nombres entiers pour dénombrer, ordonner, repérer, comparer."},0,10,{"$f":"IF(F16=F15,VLOOKUP(F16,OFFSET(G$7,K15,0,1,1):J$26,4,0),VLOOKUP(F16,G$7:J$26,4,0))","v":10},{"$f":"'Bilan - élève'!T24","v":0},10,{"$f":"IF(I16=I15,VLOOKUP(I16,OFFSET(L$7,N15,0,1,1):M$26,2,0),VLOOKUP(I16,L$7:M$26,2,0))","v":10},{"$f":"Programmes!$B15","v":"Comprendre et utiliser des nombres entiers pour dénombrer, ordonner, repérer, comparer."},{"$f":"'Bilan - élève'!I29","v":""}]
[11,{"$f":"IF(F17=F16,VLOOKUP(F17,OFFSET(G$7,K16,0,1,1):H$26,2,0),VLOOKUP(F17,G$7:H$26,2,0))","v":"Nommer, lire, écrire, représenter des nombres entiers."},null,null,null,"","",{"$f":"IF(I17=I16,VLOOKUP(I17,OFFSET(L$7,N16,0,1,1):O$26,4,0),VLOOKUP(I17,L$7:O$26,4,0))","v":"Nommer, lire, écrire, représenter des nombres entiers."},0,11,{"$f":"IF(F17=F16,VLOOKUP(F17,OFFSET(G$7,K16,0,1,1):J$26,4,0),VLOOKUP(F17,G$7:J$26,4,0))","v":11},{"$f":"'Bilan - élève'!T25","v":0},11,{"$f":"IF(I17=I16,VLOOKUP(I17,OFFSET(L$7,N16,0,1,1):M$26,2,0),VLOOKUP(I17,L$7:M$26,2,0))","v":11},{"$f":"Programmes!$B16","v":"Nommer, lire, écrire, représenter des nombres entiers."},{"$f":"'Bilan - élève'!I30","v":""}]
[12,{"$f":"IF(F18=F17,VLOOKUP(F18,OFFSET(G$7,K17,0,1,1):H$26,2,0),VLOOKUP(F18,G$7:H$26,2,0))","v":"Résoudre des problèmes en utilisant des nombres entiers et le calcul."},null,null,null,"","",{"$f":"IF(I18=I17,VLOOKUP(I18,OFFSET(L$7,N17,0,1,1):O$26,4,0),VLOOKUP(I18,L$7:O$26,4,0))","v":"Résoudre des problèmes en utilisant des nombres entiers et le calcul."},0,12,{"$f":"IF(F18=F17,VLOOKUP(F18,OFFSET(G$7,K17,0,1,1):J$26,4,0),VLOOKUP(F18,G$7:J$26,4,0))","v":12},{"$f":"'Bilan - élève'!T26","v":0},12,{"$f":"IF(I18=I17,VLOOKUP(I18,OFFSET(L$7,N17,0,1,1):M$26,2,0),VLOOKUP(I18,L$7:M$26,2,0))","v":12},{"$f":"Programmes!$B17","v":"Résoudre des problèmes en utilisant des nombres entiers et le calcul."},{"$f":"'Bilan - élève'!I31","v":""}]
[13,{"$f":"IF(F19=F18,VLOOKUP(F19,OFFSET(G$7,K18,0,1,1):H$26,2,0),VLOOKUP(F19,G$7:H$26,2,0))","v":"Calculer avec des nombres entiers."},null,null,null,"","",{"$f":"IF(I19=I18,VLOOKUP(I19,OFFSET(L$7,N18,0,1,1):O$26,4,0),VLOOKUP(I19,L$7:O$26,4,0))","v":"Calculer avec des nombres entiers."},0,13,{"$f":"IF(F19=F18,VLOOKUP(F19,OFFSET(G$7,K18,0,1,1):J$26,4,0),VLOOKUP(F19,G$7:J$26,4,0))","v":13},{"$f":"'Bilan - élève'!T27","v":0},13,{"$f":"IF(I19=I18,VLOOKUP(I19,OFFSET(L$7,N18,0,1,1):M$26,2,0),VLOOKUP(I19,L$7:M$26,2,0))","v":13},{"$f":"Programmes!$B18","v":"Calculer avec des nombres entiers."},{"$f":"'Bilan - élève'!I32","v":""}]
[14,{"$f":"IF(F20=F19,VLOOKUP(F20,OFFSET(G$7,K19,0,1,1):H$26,2,0),VLOOKUP(F20,G$7:H$26,2,0))","v":"Comparer, estimer, mesurer des longueurs, des masses, des contenances, des durées."},null,null,null,"","",{"$f":"IF(I20=I19,VLOOKUP(I20,OFFSET(L$7,N19,0,1,1):O$26,4,0),VLOOKUP(I20,L$7:O$26,4,0))","v":"Comparer, estimer, mesurer des longueurs, des masses, des contenances, des durées."},0,14,{"$f":"IF(F20=F19,VLOOKUP(F20,OFFSET(G$7,K19,0,1,1):J$26,4,0),VLOOKUP(F20,G$7:J$26,4,0))","v":14},{"$f":"'Bilan - élève'!T28","v":0},14,{"$f":"IF(I20=I19,VLOOKUP(I20,OFFSET(L$7,N19,0,1,1):M$26,2,0),VLOOKUP(I20,L$7:M$26,2,0))","v":14},{"$f":"Programmes!$B19","v":"Comparer, estimer, mesurer des longueurs, des masses, des contenances, des durées."},{"$f":"'Bilan - élève'!I34","v":""}]
[15,{"$f":"IF(F21=F20,VLOOKUP(F21,OFFSET(G$7,K20,0,1,1):H$26,2,0),VLOOKUP(F21,G$7:H$26,2,0))","v":"Utiliser le lexique, les unités, les instruments de mesures spécifiques de ces grandeurs."},null,null,null,"","",{"$f":"IF(I21=I20,VLOOKUP(I21,OFFSET(L$7,N20,0,1,1):O$26,4,0),VLOOKUP(I21,L$7:O$26,4,0))","v":"Utiliser le lexique, les unités, les instruments de mesures spécifiques de ces grandeurs."},0,15,{"$f":"IF(F21=F20,VLOOKUP(F21,OFFSET(G$7,K20,0,1,1):J$26,4,0),VLOOKUP(F21,G$7:J$26,4,0))","v":15},{"$f":"'Bilan - élève'!T29","v":0},15,{"$f":"IF(I21=I20,VLOOKUP(I21,OFFSET(L$7,N20,0,1,1):M$26,2,0),VLOOKUP(I21,L$7:M$26,2,0))","v":15},{"$f":"Programmes!$B20","v":"Utiliser le lexique, les unités, les instruments de mesures spécifiques de ces grandeurs."},{"$f":"'Bilan - élève'!I35","v":""}]
[16,{"$f":"IF(F22=F21,VLOOKUP(F22,OFFSET(G$7,K21,0,1,1):H$26,2,0),VLOOKUP(F22,G$7:H$26,2,0))","v":"Résoudre des problèmes impliquant des longueurs, des masses, des contenances, des durées…"},null,null,null,"","",{"$f":"IF(I22=I21,VLOOKUP(I22,OFFSET(L$7,N21,0,1,1):O$26,4,0),VLOOKUP(I22,L$7:O$26,4,0))","v":"Résoudre des problèmes impliquant des longueurs, des masses, des contenances, des durées…"},0,16,{"$f":"IF(F22=F21,VLOOKUP(F22,OFFSET(G$7,K21,0,1,1):J$26,4,0),VLOOKUP(F22,G$7:J$26,4,0))","v":16},{"$f":"'Bilan - élève'!T30","v":0},16,{"$f":"IF(I22=I21,VLOOKUP(I22,OFFSET(L$7,N21,0,1,1):M$26,2,0),VLOOKUP(I22,L$7:M$26,2,0))","v":16},{"$f":"Programmes!$B21","v":"Résoudre des problèmes impliquant des longueurs, des masses, des contenances, des durées…"},{"$f":"'Bilan - élève'!I36","v":""}]
[17,{"$f":"IF(F23=F22,VLOOKUP(F23,OFFSET(G$7,K22,0,1,1):H$26,2,0),VLOOKUP(F23,G$7:H$26,2,0))","v":"(Se) repérer et (se) déplacer en utilisant des repères et des représentations."},null,null,null,"","",{"$f":"IF(I23=I22,VLOOKUP(I23,OFFSET(L$7,N22,0,1,1):O$26,4,0),VLOOKUP(I23,L$7:O$26,4,0))","v":"(Se) repérer et (se) déplacer en utilisant des repères et des représentations."},0,17,{"$f":"IF(F23=F22,VLOOKUP(F23,OFFSET(G$7,K22,0,1,1):J$26,4,0),VLOOKUP(F23,G$7:J$26,4,0))","v":17},{"$f":"'Bilan - élève'!T31","v":0},17,{"$f":"IF(I23=I22,VLOOKUP(I23,OFFSET(L$7,N22,0,1,1):M$26,2,0),VLOOKUP(I23,L$7:M$26,2,0))","v":17},{"$f":"Programmes!$B22","v":"(Se) repérer et (se) déplacer en utilisant des repères et des représentations."},{"$f":"'Bilan - élève'!I38","v":""}]
[18,{"$f":"IF(F24=F23,VLOOKUP(F24,OFFSET(G$7,K23,0,1,1):H$26,2,0),VLOOKUP(F24,G$7:H$26,2,0))","v":"Reconnaitre, nommer, décrire, reproduire quelques solides."},null,null,null,"","",{"$f":"IF(I24=I23,VLOOKUP(I24,OFFSET(L$7,N23,0,1,1):O$26,4,0),VLOOKUP(I24,L$7:O$26,4,0))","v":"Reconnaitre, nommer, décrire, reproduire quelques solides."},0,18,{"$f":"IF(F24=F23,VLOOKUP(F24,OFFSET(G$7,K23,0,1,1):J$26,4,0),VLOOKUP(F24,G$7:J$26,4,0))","v":18},{"$f":"'Bilan - élève'!T32","v":0},18,{"$f":"IF(I24=I23,VLOOKUP(I24,OFFSET(L$7,N23,0,1,1):M$26,2,0),VLOOKUP(I24,L$7:M$26,2,0))","v":18},{"$f":"Programmes!$B23","v":"Reconnaitre, nommer, décrire, reproduire quelques solides."},{"$f":"'Bilan - élève'!I39","v":""}]
[19,{"$f":"IF(F25=F24,VLOOKUP(F25,OFFSET(G$7,K24,0,1,1):H$26,2,0),VLOOKUP(F25,G$7:H$26,2,0))","v":"Reconnaitre, nommer, décrire, reproduire, construire quelques figures géométriques."},null,null,null,"","",{"$f":"IF(I25=I24,VLOOKUP(I25,OFFSET(L$7,N24,0,1,1):O$26,4,0),VLOOKUP(I25,L$7:O$26,4,0))","v":"Reconnaitre, nommer, décrire, reproduire, construire quelques figures géométriques."},0,19,{"$f":"IF(F25=F24,VLOOKUP(F25,OFFSET(G$7,K24,0,1,1):J$26,4,0),VLOOKUP(F25,G$7:J$26,4,0))","v":19},{"$f":"'Bilan - élève'!T33","v":0},19,{"$f":"IF(I25=I24,VLOOKUP(I25,OFFSET(L$7,N24,0,1,1):M$26,2,0),VLOOKUP(I25,L$7:M$26,2,0))","v":19},{"$f":"Programmes!$B24","v":"Reconnaitre, nommer, décrire, reproduire, construire quelques figures géométriques."},{"$f":"'Bilan - élève'!I40","v":""}]
[20,{"$f":"IF(F26=F25,VLOOKUP(F26,OFFSET(G$7,K25,0,1,1):H$26,2,0),VLOOKUP(F26,G$7:H$26,2,0))","v":"Reconnaitre et utiliser les notions d’alignement, d’angle droit, d’égalité de longueurs, de milieu…"},null,null,null,"","",{"$f":"IF(I26=I25,VLOOKUP(I26,OFFSET(L$7,N25,0,1,1):O$26,4,0),VLOOKUP(I26,L$7:O$26,4,0))","v":"Reconnaitre et utiliser les notions d’alignement, d’angle droit, d’égalité de longueurs, de milieu…"},0,20,{"$f":"IF(F26=F25,VLOOKUP(F26,OFFSET(G$7,K25,0,1,1):J$26,4,0),VLOOKUP(F26,G$7:J$26,4,0))","v":20},{"$f":"'Bilan - élève'!T34","v":0},20,{"$f":"IF(I26=I25,VLOOKUP(I26,OFFSET(L$7,N25,0,1,1):M$26,2,0),VLOOKUP(I26,L$7:M$26,2,0))","v":20},{"$f":"Programmes!$B25","v":"Reconnaitre et utiliser les notions d’alignement, d’angle droit, d’égalité de longueurs, de milieu…"},{"$f":"'Bilan - élève'!I41","v":""}]
[]
["Légende"]
[]
[null,null,0,"Objectifs d'apprentissage non atteints"]
[null,null,50,"Objectifs d'apprentissage partiellement atteints"]
[null,null,75,"Objectifs d'apprentissage atteints ou dépassés"]
[]
[]
[{"$f":"Informations!$A$14","v":" : "},null,null,null,null,{"$f":"Informations!$B$14","v":" : "}]
[{"$f":"Informations!$A$15","v":""},null,null,null,null,{"$f":"Informations!$B$2","v":"2016-2017"}]

{"sheet":"Bilan - classe","index":8,"n_rows":109,"n_cols":23,"rows_kept":109,"cut":false,"hidden":false,"merged":[[52,0,52,8],[86,0,86,8],[77,0,77,8],[61,0,61,8],[0,0,0,6],[79,3,79,6],[64,3,64,6],[3,0,3,8],[5,3,5,6],[54,3,54,6],[42,3,42,6],[5,7,5,8],[42,7,42,8],[54,7,54,8],[64,7,64,8],[71,0,71,8]]}
[{"$f":"\"CLASSE DE \" & UPPER(Informations!B7)","v":"CLASSE DE "},null,null,null,null,null,null,null,"CE2"]
["Académie de Paris",null,null,null,null,null,null,null,{"$f":"IF(ISBLANK(Informations!$B$2),\"\",Informations!$B$2)","v":"2016-2017"}]
[]
["BILAN DE L'ÉVALUATION DIAGNOSTIQUE"]
[]
[null,null,null,"Par niveau de difficulté",null,null,null,"Total"]
[null,null,null,1,2,3,4,"/","%",null,1,2,3,4,1,2,3,4,null,"Difficulté",null,null,"Dénominateur simplifié"]
["#","Français",null,{"$f":"IF(SUM(O10:O25)>0,SUM(K10:K25)/SUM(O10:O25),\"\")","v":""},{"$f":"IF(SUM(P10:P25)>0,SUM(L10:L25)/SUM(P10:P25),\"\")","v":""},{"$f":"IF(SUM(Q10:Q25)>0,SUM(M10:M25)/SUM(Q10:Q25),\"\")","v":""},{"$f":"IF(SUM(R10:R25)>0,SUM(N10:N25)/SUM(R10:R25),\"\")","v":""},{"$f":"IF(ISNUMBER(I8),\"/\" & W8,\"\")","v":""},{"$f":"IF(SUM(O10:R25)>0,ROUND(SUM(K10:N25)/SUM(O10:R25),2),\"\")","v":""},null,null,null,null,null,null,null,null,null,null,null,null,null,{"$f":"SUM(O10:R25)/3","v":0}]
[null,{"$f":"Programmes!E2","v":"Langage oral"},null,{"$f":"IF(SUM(O10:O17)>0,SUM(K10:K17)/SUM(O10:O17),\"\")","v":""},{"$f":"IF(SUM(P10:P17)>0,SUM(L10:L17)/SUM(P10:P17),\"\")","v":""},{"$f":"IF(SUM(Q10:Q17)>0,SUM(M10:M17)/SUM(Q10:Q17),\"\")","v":""},{"$f":"IF(SUM(R10:R17)>0,SUM(N10:N17)/SUM(R10:R17),\"\")","v":""},"",{"$f":"IF(SUM(O10:R17)>0,ROUND(SUM(K10:N17)/SUM(O10:R17),2),\"\")","v":""},null,null,null,null,null,null,null,null,null,null,null,null,null,{"$f":"SUM(O10:R13)/3","v":0}]
[{"$f":"Programmes!C2","v":1},{"$f":"Programmes!B2","v":"Conserver une attention soutenue et manifester, si besoin et à bon escient, son incompréhension."},null,{"$f":"IF(O10>0,K10/O10,\"\")","v":""},"","","","",{"$f":"IF(SUM(O10:R10)>0,ROUND(SUM(K10:N10)/SUM(O10:R10),2),\"\")","v":""},1,{"$f":"INDEX(tri_des_resultats_2,($J10-1)*4+D$7)","v":0},0,0,0,{"$f":"INDEX(tri_des_possibles_2,($J10-1)*4+D$7)","v":0},0,0,0,null,{"$f":"1*O10+2*P10+3*Q10+4*R10","v":0},null,null,{"$f":"SUM(O10:R10)/3","v":0}]
[{"$f":"Programmes!C3","v":2},{"$f":"Programmes!B3","v":"Produire des énoncés clairs en tenant compte de l’objet du propos et des interlocuteurs."},null,{"$f":"IF(O11>0,K11/O11,\"\")","v":""},{"$f":"IF(P11>0,L11/P11,\"\")","v":""},{"$f":"IF(Q11>0,M11/Q11,\"\")","v":""},{"$f":"IF(R11>0,N11/R11,\"\")","v":""},"",{"$f":"IF(SUM(O11:R11)>0,ROUND(SUM(K11:N11)/SUM(O11:R11),2),\"\")","v":""},2,{"$f":"INDEX(tri_des_resultats_2,($J11-1)*4+D$7)","v":0},{"$f":"INDEX(tri_des_resultats_2,($J11-1)*4+E$7)","v":0},{"$f":"INDEX(tri_des_resultats_2,($J11-1)*4+F$7)","v":0},{"$f":"INDEX(tri_des_resultats_2,($J11-1)*4+G$7)","v":0},{"$f":"INDEX(tri_des_possibles_2,($J11-1)*4+D$7)","v":0},{"$f":"INDEX(tri_des_possibles_2,($J11-1)*4+E$7)","v":0},{"$f":"INDEX(tri_des_possibles_2,($J11-1)*4+F$7)","v":0},{"$f":"INDEX(tri_des_possibles_2,($J11-1)*4+G$7)","v":0},null,{"$f":"1*O11+2*P11+3*Q11+4*R11","v":0},null,null,{"$f":"SUM(O11:R11)/3","v":0}]
[{"$f":"Programmes!C4","v":3},{"$f":"Programmes!B4","v":"Pratiquer avec efficacité les formes de discours attendues - notamment raconter, décrire, expliquer."},null,"","","","","",{"$f":"IF(SUM(O12:R12)>0,ROUND(SUM(K12:N12)/SUM(O12:R12),2),\"\")","v":""},3,0,0,0,0,0,0,0,0,null,{"$f":"1*O12+2*P12+3*Q12+4*R12","v":0},null,null,{"$f":"SUM(O12:R12)/3","v":0}]
[{"$f":"Programmes!C5","v":4},{"$f":"Programmes!B5","v":"Participer avec pertinence à un échange."},null,"","","","","",{"$f":"IF(SUM(O13:R13)>0,ROUND(SUM(K13:N13)/SUM(O13:R13),2),\"\")","v":""},4,0,0,0,0,0,0,0,0,null,{"$f":"1*O13+2*P13+3*Q13+4*R13","v":0},null,null,{"$f":"SUM(O13:R13)/3","v":0}]
[null,{"$f":"Programmes!E6","v":"Lecture et compréhension de l'écrit"},null,{"$f":"IF(SUM(O15:O17)>0,SUM(K15:K17)/SUM(O15:O17),\"\")","v":""},{"$f":"IF(SUM(P15:P17)>0,SUM(L15:L17)/SUM(P15:P17),\"\")","v":""},{"$f":"IF(SUM(Q15:Q17)>0,SUM(M15:M17)/SUM(Q15:Q17),\"\")","v":""},{"$f":"IF(SUM(R15:R17)>0,SUM(N15:N17)/SUM(R15:R17),\"\")","v":""},"",{"$f":"IF(SUM(O15:R17)>0,ROUND(SUM(K15:N17)/SUM(O15:R17),2),\"\")","v":""},null,null,null,null,null,null,null,null,null,null,null,null,null,{"$f":"SUM(O15:R17)/3","v":0}]
[{"$f":"Programmes!C6","v":5},{"$f":"Programmes!B6","v":"Identifier des mots rapidement."},null,{"$f":"IF(O15>0,K15/O15,\"\")","v":""},{"$f":"IF(P15>0,L15/P15,\"\")","v":""},{"$f":"IF(Q15>0,M15/Q15,\"\")","v":""},{"$f":"IF(R15>0,N15/R15,\"\")","v":""},"",{"$f":"IF(SUM(O15:R15)>0,ROUND(SUM(K15:N15)/SUM(O15:R15),2),\"\")","v":""},5,{"$f":"INDEX(tri_des_resultats_2,($J15-1)*4+D$7)","v":0},{"$f":"INDEX(tri_des_resultats_2,($J15-1)*4+E$7)","v":0},{"$f":"INDEX(tri_des_resultats_2,($J15-1)*4+F$7)","v":0},{"$f":"INDEX(tri_des_resultats_2,($J15-1)*4+G$7)","v":0},{"$f":"INDEX(tri_des_possibles_2,($J15-1)*4+D$7)","v":0},{"$f":"INDEX(tri_des_possibles_2,($J15-1)*4+E$7)","v":0},{"$f":"INDEX(tri_des_possibles_2,($J15-1)*4+F$7)","v":0},{"$f":"INDEX(tri_des_possibles_2,($J15-1)*4+G$7)","v":0},null,{"$f":"1*O15+2*P15+3*Q15+4*R15","v":0},null,null,{"$f":"SUM(O15:R15)/3","v":0}]
[{"$f":"Programmes!C7","v":6},{"$f":"Programmes!B7","v":"Lire et comprendre des textes adaptés à la maturité et à la culture scolaire des élèves."},null,"","","","","",{"$f":"IF(SUM(O16:R16)>0,ROUND(SUM(K16:N16)/SUM(O16:R16),2),\"\")","v":""},6,0,0,0,0,0,0,0,0,null,{"$f":"1*O16+2*P16+3*Q16+4*R16","v":0},null,null,{"$f":"SUM(O16:R16)/3","v":0}]
[{"$f":"Programmes!C8","v":7},{"$f":"Programmes!B8","v":"Lire à voix haute avec fluidité, après préparation, un texte d’une demi-page."},null,"","","","","",{"$f":"IF(SUM(O17:R17)>0,ROUND(SUM(K17:N17)/SUM(O17:R17),2),\"\")","v":""},7,0,0,0,0,0,0,0,0,null,0,null,null,{"$f":"SUM(O17:R17)/3","v":0}]
[null,{"$f":"Programmes!E9","v":"Écriture"},null,{"$f":"IF(SUM(O19:O21)>0,SUM(K19:K21)/SUM(O19:O21),\"\")","v":""},{"$f":"IF(SUM(P19:P21)>0,SUM(L19:L21)/SUM(P19:P21),\"\")","v":""},{"$f":"IF(SUM(Q19:Q21)>0,SUM(M19:M21)/SUM(Q19:Q21),\"\")","v":""},{"$f":"IF(SUM(R19:R21)>0,SUM(N19:N21)/SUM(R19:R21),\"\")","v":""},"",{"$f":"IF(SUM(O19:R21)>0,ROUND(SUM(K19:N21)/SUM(O19:R21),2),\"\")","v":""},null,null,null,null,null,null,null,null,null,null,null,null,null,{"$f":"SUM(O19:R21)/3","v":0}]
[{"$f":"Programmes!C9","v":8},{"$f":"Programmes!B9","v":"Copier ou transcrire, dans une écriture lisible, un texte d’une dizaine de lignes."},null,{"$f":"IF(O19>0,K19/O19,\"\")","v":""},"","","","",{"$f":"IF(SUM(O19:R19)>0,ROUND(SUM(K19:N19)/SUM(O19:R19),2),\"\")","v":""},8,{"$f":"INDEX(tri_des_resultats_2,($J19-1)*4+D$7)","v":0},0,0,0,{"$f":"INDEX(tri_des_possibles_2,($J19-1)*4+D$7)","v":0},0,0,0,null,{"$f":"1*O19+2*P19+3*Q19+4*R19","v":0},null,null,{"$f":"SUM(O19:R19)/3","v":0}]
[{"$f":"Programmes!C10","v":9},{"$f":"Programmes!B10","v":"Rédiger un texte d’environ une demi-page, cohérent, organisé, ponctué, pertinent."},null,{"$f":"IF(O20>0,K20/O20,\"\")","v":""},{"$f":"IF(P20>0,L20/P20,\"\")","v":""},{"$f":"IF(Q20>0,M20/Q20,\"\")","v":""},{"$f":"IF(R20>0,N20/R20,\"\")","v":""},"",{"$f":"IF(SUM(O20:R20)>0,ROUND(SUM(K20:N20)/SUM(O20:R20),2),\"\")","v":""},9,0,0,0,0,0,0,0,0,null,{"$f":"1*O20+2*P20+3*Q20+4*R20","v":0},null,null,{"$f":"SUM(O20:R20)/3","v":0}]
[{"$f":"Programmes!C11","v":10},{"$f":"Programmes!B11","v":"Améliorer une production, notamment l’orthographe, en tenant compte d’indications."},null,"","","","","",{"$f":"IF(SUM(O21:R21)>0,ROUND(SUM(K21:N21)/SUM(O21:R21),2),\"\")","v":""},10,0,0,0,0,0,0,0,0,null,{"$f":"1*O21+2*P21+3*Q21+4*R21","v":0},null,null,{"$f":"SUM(O21:R21)/3","v":0}]
[null,{"$f":"Programmes!E12","v":"Étude de la langue (grammaire, orthographe, lexique)"},null,{"$f":"IF(SUM(O23:O25)>0,SUM(K23:K25)/SUM(O23:O25),\"\")","v":""},{"$f":"IF(SUM(P23:P25)>0,SUM(L23:L25)/SUM(P23:P25),\"\")","v":""},{"$f":"IF(SUM(Q23:Q25)>0,SUM(M23:M25)/SUM(Q23:Q25),\"\")","v":""},{"$f":"IF(SUM(R23:R25)>0,SUM(N23:N25)/SUM(R23:R25),\"\")","v":""},"",{"$f":"IF(SUM(O23:R25)>0,ROUND(SUM(K23:N25)/SUM(O23:R25),2),\"\")","v":""},null,null,null,null,null,null,null,null,null,null,null,null,null,{"$f":"SUM(O23:R25)/3","v":0}]
[{"$f":"Programmes!C12","v":11},{"$f":"Programmes!B12","v":"Orthographier les mots les plus fréquents et les mots invariables mémorisés."},null,{"$f":"IF(O23>0,K23/O23,\"\")","v":""},"","","","",{"$f":"IF(SUM(O23:R23)>0,ROUND(SUM(K23:N23)/SUM(O23:R23),2),\"\")","v":""},11,{"$f":"INDEX(tri_des_resultats_2,($J23-1)*4+D$7)","v":0},0,0,0,{"$f":"INDEX(tri_des_possibles_2,($J23-1)*4+D$7)","v":0},0,0,0,null,{"$f":"1*O23+2*P23+3*Q23+4*R23","v":0},null,null,{"$f":"SUM(O23:R23)/3","v":0}]
[{"$f":"Programmes!C13","v":12},{"$f":"Programmes!B13","v":"Raisonner pour réaliser les accords dans le groupe nominal et entre le verbe et son sujet."},null,"","","","","",{"$f":"IF(SUM(O24:R24)>0,ROUND(SUM(K24:N24)/SUM(O24:R24),2),\"\")","v":""},12,0,0,0,0,0,0,0,0,null,{"$f":"1*O24+2*P24+3*Q24+4*R24","v":0},null,null,{"$f":"SUM(O24:R24)/3","v":0}]
[{"$f":"Programmes!C14","v":13},{"$f":"Programmes!B14","v":"Utiliser ses connaissances sur la langue. "},null,{"$f":"IF(O25>0,K25/O25,\"\")","v":""},{"$f":"IF(P25>0,L25/P25,\"\")","v":""},{"$f":"IF(Q25>0,M25/Q25,\"\")","v":""},{"$f":"IF(R25>0,N25/R25,\"\")","v":""},"",{"$f":"IF(SUM(O25:R25)>0,ROUND(SUM(K25:N25)/SUM(O25:R25),2),\"\")","v":""},13,0,0,0,0,0,0,0,0,null,{"$f":"1*O25+2*P25+3*Q25+4*R25","v":0},null,null,{"$f":"SUM(O25:R25)/3","v":0}]
[]
["#","Mathématiques",null,{"$f":"IF(SUM(O29:O41)>0,SUM(K29:K41)/SUM(O29:O41),\"\")","v":""},{"$f":"IF(SUM(P29:P41)>0,SUM(L29:L41)/SUM(P29:P41),\"\")","v":""},{"$f":"IF(SUM(Q29:Q41)>0,SUM(M29:M41)/SUM(Q29:Q41),\"\")","v":""},{"$f":"IF(SUM(R29:R41)>0,SUM(N29:N41)/SUM(R29:R41),\"\")","v":""},{"$f":"IF(ISNUMBER(I27),\"/\" & W27,\"\")","v":""},{"$f":"IF(SUM(O29:R41)>0,ROUND(SUM(K29:N41)/SUM(O29:R41),2),\"\")","v":""},null,null,null,null,null,null,null,null,null,null,null,null,null,{"$f":"SUM(O29:R41)/3","v":0}]
[null,{"$f":"Programmes!E15","v":"Nombres et calculs"},null,{"$f":"IF(SUM(O29:O32)>0,SUM(K29:K32)/SUM(O29:O32),\"\")","v":""},{"$f":"IF(SUM(P29:P32)>0,SUM(L29:L32)/SUM(P29:P32),\"\")","v":""},{"$f":"IF(SUM(Q29:Q32)>0,SUM(M29:M32)/SUM(Q29:Q32),\"\")","v":""},{"$f":"IF(SUM(R29:R32)>0,SUM(N29:N32)/SUM(R29:R32),\"\")","v":""},"",{"$f":"IF(SUM(O29:R32)>0,ROUND(SUM(K29:N32)/SUM(O29:R32),2),\"\")","v":""},null,null,null,null,null,null,null,null,null,null,null,null,null,{"$f":"SUM(O29:R32)/3","v":0}]
[{"$f":"Programmes!C15","v":14},{"$f":"Programmes!B15","v":"Comprendre et utiliser des nombres entiers pour dénombrer, ordonner, repérer, comparer."},null,{"$f":"IF(O29>0,K29/O29,\"\")","v":""},"","","","",{"$f":"IF(SUM(O29:R29)>0,ROUND(SUM(K29:N29)/SUM(O29:R29),2),\"\")","v":""},1,{"$f":"INDEX(tri_des_resultats_2,($J29+12)*4+D$7)","v":0},0,0,0,{"$f":"INDEX(tri_des_possibles_2,($J29+12)*4+D$7)","v":0},0,0,0,null,{"$f":"1*O29+2*P29+3*Q29+4*R29","v":0},null,null,{"$f":"SUM(O29:R29)/3","v":0}]
[{"$f":"Programmes!C16","v":15},{"$f":"Programmes!B16","v":"Nommer, lire, écrire, représenter des nombres entiers."},null,"","","","","","",2,0,0,0,0,0,0,0,0,null,0,null,null,{"$f":"SUM(O30:R30)/3","v":0}]
[{"$f":"Programmes!C17","v":16},{"$f":"Programmes!B17","v":"Résoudre des problèmes en utilisant des nombres entiers et le calcul."},null,"","","","","","",3,0,0,0,0,0,0,0,0,null,0,null,null,{"$f":"SUM(O31:R31)/3","v":0}]
[{"$f":"Programmes!C18","v":17},{"$f":"Programmes!B18","v":"Calculer avec des nombres entiers."},null,"","","","","","",4,0,0,0,0,0,0,0,0,null,0,null,null,{"$f":"SUM(O32:R32)/3","v":0}]
[null,{"$f":"Programmes!E19","v":"Grandeurs et mesures"},null,{"$f":"IF(SUM(O34:O36)>0,SUM(K34:K36)/SUM(O34:O36),\"\")","v":""},{"$f":"IF(SUM(P34:P36)>0,SUM(L34:L36)/SUM(P34:P36),\"\")","v":""},{"$f":"IF(SUM(Q34:Q36)>0,SUM(M34:M36)/SUM(Q34:Q36),\"\")","v":""},{"$f":"IF(SUM(R34:R36)>0,SUM(N34:N36)/SUM(R34:R36),\"\")","v":""},"",{"$f":"IF(SUM(O34:R36)>0,ROUND(SUM(K34:N36)/SUM(O34:R36),2),\"\")","v":""},null,null,null,null,null,null,null,null,null,null,null,null,null,{"$f":"SUM(O34:R36)/3","v":0}]
[{"$f":"Programmes!C19","v":18},{"$f":"Programmes!B19","v":"Comparer, estimer, mesurer des longueurs, des masses, des contenances, des durées."},null,{"$f":"IF(O34>0,K34/O34,\"\")","v":""},"","","","",{"$f":"IF(SUM(O34:R34)>0,ROUND(SUM(K34:N34)/SUM(O34:R34),2),\"\")","v":""},5,{"$f":"INDEX(tri_des_resultats_2,($J34+12)*4+D$7)","v":0},0,0,0,{"$f":"INDEX(tri_des_possibles_2,($J34+12)*4+D$7)","v":0},0,0,0,null,{"$f":"1*O34+2*P34+3*Q34+4*R34","v":0},null,null,{"$f":"SUM(O34:R34)/3","v":0}]
[{"$f":"Programmes!C20","v":19},{"$f":"Programmes!B20","v":"Utiliser le lexique, les unités, les instruments de mesures spécifiques de ces grandeurs."},null,"","","","","",{"$f":"IF(SUM(O35:R35)>0,ROUND(SUM(K35:N35)/SUM(O35:R35),2),\"\")","v":""},6,0,0,0,0,0,0,0,0,null,{"$f":"1*O35+2*P35+3*Q35+4*R35","v":0},null,null,{"$f":"SUM(O35:R35)/3","v":0}]
[{"$f":"Programmes!C21","v":20},{"$f":"Programmes!B21","v":"Résoudre des problèmes impliquant des longueurs, des masses, des contenances, des durées…"},null,"","","","","",{"$f":"IF(SUM(O36:R36)>0,ROUND(SUM(K36:N36)/SUM(O36:R36),2),\"\")","v":""},7,0,0,0,0,0,0,0,0,null,{"$f":"1*O36+2*P36+3*Q36+4*R36","v":0},null,null,{"$f":"SUM(O36:R36)/3","v":0}]
[null,{"$f":"Programmes!E22","v":"Espace et géométrie"},null,{"$f":"IF(SUM(O38:O41)>0,SUM(K38:K41)/SUM(O38:O41),\"\")","v":""},{"$f":"IF(SUM(P38:P41)>0,SUM(L38:L41)/SUM(P38:P41),\"\")","v":""},{"$f":"IF(SUM(Q38:Q41)>0,SUM(M38:M41)/SUM(Q38:Q41),\"\")","v":""},{"$f":"IF(SUM(R38:R41)>0,SUM(N38:N41)/SUM(R38:R41),\"\")","v":""},"",{"$f":"IF(SUM(O38:R40)>0,ROUND(SUM(K38:N40)/SUM(O38:R40),2),\"\")","v":""},null,null,null,null,null,null,null,null,null,null,null,null,null,{"$f":"SUM(O38:R41)/3","v":0}]
[{"$f":"Programmes!C22","v":21},{"$f":"Programmes!B22","v":"(Se) repérer et (se) déplacer en utilisant des repères et des représentations."},null,{"$f":"IF(O38>0,K38/O38,\"\")","v":""},"","","","",{"$f":"IF(SUM(O38:R38)>0,ROUND(SUM(K38:N38)/SUM(O38:R38),2),\"\")","v":""},8,{"$f":"INDEX(tri_des_resultats_2,($J38+12)*4+D$7)","v":0},0,0,0,{"$f":"INDEX(tri_des_possibles_2,($J38+12)*4+D$7)","v":0},0,0,0,null,{"$f":"1*O38+2*P38+3*Q38+4*R38","v":0},null,null,{"$f":"SUM(O38:R38)/3","v":0}]
[{"$f":"Programmes!C23","v":22},{"$f":"Programmes!B23","v":"Reconnaitre, nommer, décrire, reproduire quelques solides."},null,"","","","","",{"$f":"IF(SUM(O39:R39)>0,ROUND(SUM(K39:N39)/SUM(O39:R39),2),\"\")","v":""},9,0,0,0,0,0,0,0,0,null,{"$f":"1*O39+2*P39+3*Q39+4*R39","v":0},null,null,{"$f":"SUM(O39:R39)/3","v":0}]
[{"$f":"Programmes!C24","v":23},{"$f":"Programmes!B24","v":"Reconnaitre, nommer, décrire, reproduire, construire quelques figures géométriques."},null,"","","","","",{"$f":"IF(SUM(O40:R40)>0,ROUND(SUM(K40:N40)/SUM(O40:R40),2),\"\")","v":""},10,0,0,0,0,0,0,0,0,null,{"$f":"1*O40+2*P40+3*Q40+4*R40","v":0},null,null,{"$f":"SUM(O40:R40)/3","v":0}]
[{"$f":"Programmes!C25","v":24},{"$f":"Programmes!B25","v":"Reconnaitre et utiliser les notions d’alignement, d’angle droit, d’égalité de longueurs, de milieu…"},null,{"$f":"IF(O41>0,K41/O41,\"\")","v":""},"","","","",{"$f":"IF(SUM(O41:R41)>0,ROUND(SUM(K41:N41)/SUM(O41:R41),2),\"\")","v":""},11,0,0,0,0,0,0,0,0,null,{"$f":"1*O41+2*P41+3*Q41+4*R41","v":0},null,null,{"$f":"SUM(O41:R41)/3","v":0}]
[]
[null,"LES ABSENCES DE RÉPONSE",null,"Par niveau de difficulté",null,null,null,"Total"]
[null,"Sur l'ensemble des items de l'évaluation",null,{"$f":"IF(Saisie!QJ35>0,Saisie!QJ37/Saisie!QJ35,\"\")","v":""},{"$f":"IF(Saisie!QK35>0,Saisie!QK37/Saisie!QK35,\"\")","v":""},{"$f":"IF(Saisie!QL35>0,Saisie!QL37/Saisie!QL35,\"\")","v":""},{"$f":"IF(Saisie!QM35>0,Saisie!QM37/Saisie!QM35,\"\")","v":""},{"$f":"IF(ISNUMBER(I44),\"/\" & SUM(Saisie!QJ35:QM35),\"\")","v":""},{"$f":"IF(SUM(Saisie!QJ35:QM35)>0,SUM(Saisie!QJ37:QM37)/SUM(Saisie!QJ35:QM35),\"\")","v":""}]
[]
[]
[]
[]
[{"$f":"Informations!$A$14","v":" : "},null,null,null,null,null,null,null,{"$f":"Informations!$B$14","v":" : "}]
[{"$f":"Informations!$A$15","v":""},null,null,null,null,null,null,null,{"$f":"Informations!$B$15","v":""}]
[{"$f":"IF(ISBLANK(A$1),\"\",A$1)","v":"CLASSE DE "},null,null,null,null,null,null,null,"CE2"]
[]
["BILAN DE L'ÉVALUATION DIAGNOSTIQUE"]
[]
["#","LES ACQUIS LES PLUS SÛRS",null,"Par niveau de difficulté",null,null,null,"Total"]
[{"$f":"IF(B56=\"\",\"\",VLOOKUP(B56,matrice_des_programmes,2,0))","v":1},{"$f":"IF('Réussites - classe'!F7>=0.75,'Réussites - classe'!B7,\"\")","v":"Conserver une attention soutenue et manifester, si besoin et à bon escient, son incompréhension."},null,{"$f":"IF(B56=\"\",\"\",VLOOKUP(A56,matrice_du_bilan_2,4,0))","v":""},{"$f":"IF(B56=\"\",\"\",VLOOKUP(A56,matrice_du_bilan_2,5,0))","v":""},{"$f":"IF(B56=\"\",\"\",VLOOKUP(A56,matrice_du_bilan_2,6,0))","v":""},{"$f":"IF(B56=\"\",\"\",VLOOKUP(A56,matrice_du_bilan_2,7,0))","v":""},{"$f":"IF(B56=\"\",\"\",VLOOKUP(A56,matrice_du_bilan_2,8,0))","v":""},{"$f":"IF(B56=\"\",\"\",VLOOKUP(A56,matrice_du_bilan_2,9,0))","v":""}]
[{"$f":"IF(B57=\"\",\"\",VLOOKUP(B57,matrice_des_programmes,2,0))","v":6},{"$f":"IF('Réussites - classe'!F8>=0.75,'Réussites - classe'!B8,\"\")","v":"Lire et comprendre des textes adaptés à la maturité et à la culture scolaire des élèves."},null,{"$f":"IF(B57=\"\",\"\",VLOOKUP(A57,matrice_du_bilan_2,4,0))","v":""},{"$f":"IF(B57=\"\",\"\",VLOOKUP(A57,matrice_du_bilan_2,5,0))","v":""},{"$f":"IF(B57=\"\",\"\",VLOOKUP(A57,matrice_du_bilan_2,6,0))","v":""},{"$f":"IF(B57=\"\",\"\",VLOOKUP(A57,matrice_du_bilan_2,7,0))","v":""},{"$f":"IF(B57=\"\",\"\",VLOOKUP(A57,matrice_du_bilan_2,8,0))","v":""},{"$f":"IF(B57=\"\",\"\",VLOOKUP(A57,matrice_du_bilan_2,9,0))","v":""}]
[{"$f":"IF(B58=\"\",\"\",VLOOKUP(B58,matrice_des_programmes,2,0))","v":7},{"$f":"IF('Réussites - classe'!F9>=0.75,'Réussites - classe'!B9,\"\")","v":"Lire à voix haute avec fluidité, après préparation, un texte d’une demi-page."},null,{"$f":"IF(B58=\"\",\"\",VLOOKUP(A58,matrice_du_bilan_2,4,0))","v":""},{"$f":"IF(B58=\"\",\"\",VLOOKUP(A58,matrice_du_bilan_2,5,0))","v":""},{"$f":"IF(B58=\"\",\"\",VLOOKUP(A58,matrice_du_bilan_2,6,0))","v":""},{"$f":"IF(B58=\"\",\"\",VLOOKUP(A58,matrice_du_bilan_2,7,0))","v":""},{"$f":"IF(B58=\"\",\"\",VLOOKUP(A58,matrice_du_bilan_2,8,0))","v":""},{"$f":"IF(B58=\"\",\"\",VLOOKUP(A58,matrice_du_bilan_2,9,0))","v":""}]
[{"$f":"IF(B59=\"\",\"\",VLOOKUP(B59,matrice_des_programmes,2,0))","v":8},{"$f":"IF('Réussites - classe'!F10>=0.75,'Réussites - classe'!B10,\"\")","v":"Copier ou transcrire, dans une écriture lisible, un texte d’une dizaine de lignes."},null,{"$f":"IF(B59=\"\",\"\",VLOOKUP(A59,matrice_du_bilan_2,4,0))","v":""},{"$f":"IF(B59=\"\",\"\",VLOOKUP(A59,matrice_du_bilan_2,5,0))","v":""},{"$f":"IF(B59=\"\",\"\",VLOOKUP(A59,matrice_du_bilan_2,6,0))","v":""},{"$f":"IF(B59=\"\",\"\",VLOOKUP(A59,matrice_du_bilan_2,7,0))","v":""},{"$f":"IF(B59=\"\",\"\",VLOOKUP(A59,matrice_du_bilan_2,8,0))","v":""},{"$f":"IF(B59=\"\",\"\",VLOOKUP(A59,matrice_du_bilan_2,9,0))","v":""}]
[{"$f":"IF(B60=\"\",\"\",VLOOKUP(B60,matrice_des_programmes,2,0))","v":9},{"$f":"IF('Réussites - classe'!F11>=0.75,'Réussites - classe'!B11,\"\")","v":"Rédiger un texte d’environ une demi-page, cohérent, organisé, ponctué, pertinent."},null,{"$f":"IF(B60=\"\",\"\",VLOOKUP(A60,matrice_du_bilan_2,4,0))","v":""},{"$f":"IF(B60=\"\",\"\",VLOOKUP(A60,matrice_du_bilan_2,5,0))","v":""},{"$f":"IF(B60=\"\",\"\",VLOOKUP(A60,matrice_du_bilan_2,6,0))","v":""},{"$f":"IF(B60=\"\",\"\",VLOOKUP(A60,matrice_du_bilan_2,7,0))","v":""},{"$f":"IF(B60=\"\",\"\",VLOOKUP(A60,matrice_du_bilan_2,8,0))","v":""},{"$f":"IF(B60=\"\",\"\",VLOOKUP(A60,matrice_du_bilan_2,9,0))","v":""}]
[]
["BILAN DE L'ÉVALUATION DIAGNOSTIQUE"]
[]
[]
["#","CE QU'IL FAUT TRAVAILLER",null,"Par niveau de difficulté",null,null,null,"Total"]
[{"$f":"IF(B66=\"\",\"\",VLOOKUP(B66,matrice_des_programmes,2,0))","v":""},{"$f":"IF('Difficultés - classe'!G7<0.75,'Difficultés - classe'!B7,\"\")","v":""},null,{"$f":"IF(B66=\"\",\"\",VLOOKUP(A66,matrice_du_bilan_2,4,0))","v":""},{"$f":"IF(B66=\"\",\"\",VLOOKUP(A66,matrice_du_bilan_2,5,0))","v":""},{"$f":"IF(B66=\"\",\"\",VLOOKUP(A66,matrice_du_bilan_2,6,0))","v":""},{"$f":"IF(B66=\"\",\"\",VLOOKUP(A66,matrice_du_bilan_2,7,0))","v":""},{"$f":"IF(B66=\"\",\"\",VLOOKUP(A66,matrice_du_bilan_2,8,0))","v":""},{"$f":"IF(B66=\"\",\"\",VLOOKUP(A66,matrice_du_bilan_2,9,0))","v":""}]
[{"$f":"IF(B67=\"\",\"\",VLOOKUP(B67,matrice_des_programmes,2,0))","v":""},{"$f":"IF('Difficultés - classe'!G8<0.75,'Difficultés - classe'!B8,\"\")","v":""},null,{"$f":"IF(B67=\"\",\"\",VLOOKUP(A67,matrice_du_bilan_2,4,0))","v":""},{"$f":"IF(B67=\"\",\"\",VLOOKUP(A67,matrice_du_bilan_2,5,0))","v":""},{"$f":"IF(B67=\"\",\"\",VLOOKUP(A67,matrice_du_bilan_2,6,0))","v":""},{"$f":"IF(B67=\"\",\"\",VLOOKUP(A67,matrice_du_bilan_2,7,0))","v":""},{"$f":"IF(B67=\"\",\"\",VLOOKUP(A67,matrice_du_bilan_2,8,0))","v":""},{"$f":"IF(B67=\"\",\"\",VLOOKUP(A67,matrice_du_bilan_2,9,0))","v":""}]
[{"$f":"IF(B68=\"\",\"\",VLOOKUP(B68,matrice_des_programmes,2,0))","v":""},{"$f":"IF('Difficultés - classe'!G9<0.75,'Difficultés - classe'!B9,\"\")","v":""},null,{"$f":"IF(B68=\"\",\"\",VLOOKUP(A68,matrice_du_bilan_2,4,0))","v":""},{"$f":"IF(B68=\"\",\"\",VLOOKUP(A68,matrice_du_bilan_2,5,0))","v":""},{"$f":"IF(B68=\"\",\"\",VLOOKUP(A68,matrice_du_bilan_2,6,0))","v":""},{"$f":"IF(B68=\"\",\"\",VLOOKUP(A68,matrice_du_bilan_2,7,0))","v":""},{"$f":"IF(B68=\"\",\"\",VLOOKUP(A68,matrice_du_bilan_2,8,0))","v":""},{"$f":"IF(B68=\"\",\"\",VLOOKUP(A68,matrice_du_bilan_2,9,0))","v":""}]
[{"$f":"IF(B69=\"\",\"\",VLOOKUP(B69,matrice_des_programmes,2,0))","v":""},{"$f":"IF('Difficultés - classe'!G10<0.75,'Difficultés - classe'!B10,\"\")","v":""},null,{"$f":"IF(B69=\"\",\"\",VLOOKUP(A69,matrice_du_bilan_2,4,0))","v":""},{"$f":"IF(B69=\"\",\"\",VLOOKUP(A69,matrice_du_bilan_2,5,0))","v":""},{"$f":"IF(B69=\"\",\"\",VLOOKUP(A69,matrice_du_bilan_2,6,0))","v":""},{"$f":"IF(B69=\"\",\"\",VLOOKUP(A69,matrice_du_bilan_2,7,0))","v":""},{"$f":"IF(B69=\"\",\"\",VLOOKUP(A69,matrice_du_bilan_2,8,0))","v":""},{"$f":"IF(B69=\"\",\"\",VLOOKUP(A69,matrice_du_bilan_2,9,0))","v":""}]
[{"$f":"IF(B70=\"\",\"\",VLOOKUP(B70,matrice_des_programmes,2,0))","v":""},{"$f":"IF('Difficultés - classe'!G11<0.75,'Difficultés - classe'!B11,\"\")","v":""},null,{"$f":"IF(B70=\"\",\"\",VLOOKUP(A70,matrice_du_bilan_2,4,0))","v":""},{"$f":"IF(B70=\"\",\"\",VLOOKUP(A70,matrice_du_bilan_2,5,0))","v":""},{"$f":"IF(B70=\"\",\"\",VLOOKUP(A70,matrice_du_bilan_2,6,0))","v":""},{"$f":"IF(B70=\"\",\"\",VLOOKUP(A70,matrice_du_bilan_2,7,0))","v":""},{"$f":"IF(B70=\"\",\"\",VLOOKUP(A70,matrice_du_bilan_2,8,0))","v":""},{"$f":"IF(B70=\"\",\"\",VLOOKUP(A70,matrice_du_bilan_2,9,0))","v":""}]
[]
["Légende"]
[]
[null,null,"Objectifs d'apprentissage non atteints",0]
[null,null,"Objectifs d'apprentissage partiellement atteints",50]
[null,null,"Objectifs d'apprentissage atteints ou dépassés",75]
[]
["Information sur les niveaux de difficulté"]
[]
[null,null,null,"Par niveau de difficulté",null,null,null,"Attendu"]
[null,null,null,1,2,3,4]
[null,"Acquis de base",null,1,null,null,null,"Oui"]
[null,"Acquis approfondis",null,null,1,null,null,"Oui"]
[null,"Acquis remarquables",null,null,null,1,null,"Non"]
[null,"Acquis experts",null,null,null,null,1,"Non"]
[]
["Les acquis de niveau 3 et 4 ne sont pas attendus à l'entrée du CE2. Les résultats doivent être analysés au regard des niveaux de difficulté des exercices."]
[]
[]
[{"$f":"Informations!$A$14","v":" : "},null,null,null,null,null,null,null,{"$f":"Informations!$B$14","v":" : "}]
[{"$f":"Informations!$A$15","v":""},null,null,null,null,null,null,null,{"$f":"Informations!$B$15","v":""}]
[]
[]
[]
[]
[]
[]
[]
[]
[]
[]
[]
[]
[]
[]
[]
[]
[{"$f":"Informations!$A$14","v":" : "},null,null,null,null,null,null,null,{"$f":"Informations!$B$14","v":" : "}]
[{"$f":"Informations!$A$15","v":""},null,null,null,null,null,null,null,{"$f":"Informations!$B$15","v":""}]

{"sheet":"Difficultés - classe","index":9,"n_rows":36,"n_cols":17,"rows_kept":36,"cut":false,"hidden":true,"merged":[[0,0,0,6],[1,0,1,6],[2,0,2,6],[5,1,5,5],[27,0,27,6]]}
["DIFFICULTÉS AUX ATTENDUS"]
[{"$f":"\"Classe de \" & Informations!B7","v":"Classe de "}]
["Évaluation diagnostique d'entrée en CE2"]
[]
[]
[null,"Compétences",null,null,null,null,"%",null,null,"Facilité 2","Numéro 1","Numéro 2","Facilité 1","Numéro 1","Numéro 2"]
[1,{"$f":"VLOOKUP(G7,H$7:I$26,2,0)","v":"Conserver une attention soutenue et manifester, si besoin et à bon escient, son incompréhension."},{"$f":"VLOOKUP(B7,matrice_des_programmes,3,0)","v":0},null,null,null,{"$f":"IF(ROW(G7)-6>COUNT(H$7:H$26),\"\",SMALL(H$7:H$26,ROW(G7)-6))","v":""},{"$f":"VLOOKUP(I7,P$7:Q$26,2,0)","v":""},{"$f":"VLOOKUP(J7,M$7:P$26,4,0)","v":"Conserver une attention soutenue et manifester, si besoin et à bon escient, son incompréhension."},{"$f":"IF(ROW(J7)-6>COUNT(M$7:M$26),\"\",LARGE(M$7:M$26,ROW(J7)-6))","v":0},1,{"$f":"VLOOKUP(G7,H$7:K$26,4,0)","v":1},{"$f":"'Bilan - élève'!U10","v":0},1,{"$f":"VLOOKUP(J7,M$7:N$26,2,0)","v":1},{"$f":"Programmes!$B2","v":"Conserver une attention soutenue et manifester, si besoin et à bon escient, son incompréhension."},{"$f":"'Bilan - classe'!I10","v":""}]
[{"$f":"IF(ISTEXT(B8),A7+1,\"\")","v":2},{"$f":"IF(G8=G7,VLOOKUP(G8,OFFSET(H$7,L7,0,1,1):I$26,2,0),VLOOKUP(G8,H$7:I$26,2,0))","v":"Lire et comprendre des textes adaptés à la maturité et à la culture scolaire des élèves."},0,null,null,null,"","",{"$f":"IF(J8=J7,VLOOKUP(J8,OFFSET(M$7,O7,0,1,1):P$26,4,0),VLOOKUP(J8,M$7:P$26,4,0))","v":"Lire et comprendre des textes adaptés à la maturité et à la culture scolaire des élèves."},0,2,{"$f":"IF(G8=G7,VLOOKUP(G8,OFFSET(H$7,L7,0,1,1):K$26,4,0),VLOOKUP(G8,H$7:K$26,4,0))","v":2},{"$f":"'Bilan - élève'!U16","v":0},2,{"$f":"IF(J8=J7,VLOOKUP(J8,OFFSET(M$7,O7,0,1,1):N$26,2,0),VLOOKUP(J8,M$7:N$26,2,0))","v":2},{"$f":"Programmes!$B7","v":"Lire et comprendre des textes adaptés à la maturité et à la culture scolaire des élèves."},{"$f":"'Bilan - classe'!I16","v":""}]
[{"$f":"IF(ISTEXT(B9),A8+1,\"\")","v":3},{"$f":"IF(G9=G8,VLOOKUP(G9,OFFSET(H$7,L8,0,1,1):I$26,2,0),VLOOKUP(G9,H$7:I$26,2,0))","v":"Lire à voix haute avec fluidité, après préparation, un texte d’une demi-page."},{"$f":"VLOOKUP(B9,matrice_des_programmes,3,0)","v":0},null,null,null,"","",{"$f":"IF(J9=J8,VLOOKUP(J9,OFFSET(M$7,O8,0,1,1):P$26,4,0),VLOOKUP(J9,M$7:P$26,4,0))","v":"Lire à voix haute avec fluidité, après préparation, un texte d’une demi-page."},0,3,{"$f":"IF(G9=G8,VLOOKUP(G9,OFFSET(H$7,L8,0,1,1):K$26,4,0),VLOOKUP(G9,H$7:K$26,4,0))","v":3},{"$f":"'Bilan - élève'!U17","v":0},3,{"$f":"IF(J9=J8,VLOOKUP(J9,OFFSET(M$7,O8,0,1,1):N$26,2,0),VLOOKUP(J9,M$7:N$26,2,0))","v":3},{"$f":"Programmes!$B8","v":"Lire à voix haute avec fluidité, après préparation, un texte d’une demi-page."},{"$f":"'Bilan - classe'!I17","v":""}]
[4,{"$f":"IF(G10=G9,VLOOKUP(G10,OFFSET(H$7,L9,0,1,1):I$26,2,0),VLOOKUP(G10,H$7:I$26,2,0))","v":"Copier ou transcrire, dans une écriture lisible, un texte d’une dizaine de lignes."},0,null,null,null,"","",{"$f":"IF(J10=J9,VLOOKUP(J10,OFFSET(M$7,O9,0,1,1):P$26,4,0),VLOOKUP(J10,M$7:P$26,4,0))","v":"Copier ou transcrire, dans une écriture lisible, un texte d’une dizaine de lignes."},0,4,{"$f":"IF(G10=G9,VLOOKUP(G10,OFFSET(H$7,L9,0,1,1):K$26,4,0),VLOOKUP(G10,H$7:K$26,4,0))","v":4},{"$f":"'Bilan - élève'!U18","v":0},4,{"$f":"IF(J10=J9,VLOOKUP(J10,OFFSET(M$7,O9,0,1,1):N$26,2,0),VLOOKUP(J10,M$7:N$26,2,0))","v":4},{"$f":"Programmes!$B9","v":"Copier ou transcrire, dans une écriture lisible, un texte d’une dizaine de lignes."},{"$f":"'Bilan - classe'!I19","v":""}]
[5,{"$f":"IF(G11=G10,VLOOKUP(G11,OFFSET(H$7,L10,0,1,1):I$26,2,0),VLOOKUP(G11,H$7:I$26,2,0))","v":"Rédiger un texte d’environ une demi-page, cohérent, organisé, ponctué, pertinent."},0,null,null,null,"","",{"$f":"IF(J11=J10,VLOOKUP(J11,OFFSET(M$7,O10,0,1,1):P$26,4,0),VLOOKUP(J11,M$7:P$26,4,0))","v":"Rédiger un texte d’environ une demi-page, cohérent, organisé, ponctué, pertinent."},0,5,{"$f":"IF(G11=G10,VLOOKUP(G11,OFFSET(H$7,L10,0,1,1):K$26,4,0),VLOOKUP(G11,H$7:K$26,4,0))","v":5},{"$f":"'Bilan - élève'!U19","v":0},5,{"$f":"IF(J11=J10,VLOOKUP(J11,OFFSET(M$7,O10,0,1,1):N$26,2,0),VLOOKUP(J11,M$7:N$26,2,0))","v":5},{"$f":"Programmes!$B10","v":"Rédiger un texte d’environ une demi-page, cohérent, organisé, ponctué, pertinent."},{"$f":"'Bilan - classe'!I20","v":""}]
[6,{"$f":"IF(G12=G11,VLOOKUP(G12,OFFSET(H$7,L11,0,1,1):I$26,2,0),VLOOKUP(G12,H$7:I$26,2,0))","v":"Améliorer une production, notamment l’orthographe, en tenant compte d’indications."},0,null,null,null,"","",{"$f":"IF(J12=J11,VLOOKUP(J12,OFFSET(M$7,O11,0,1,1):P$26,4,0),VLOOKUP(J12,M$7:P$26,4,0))","v":"Améliorer une production, notamment l’orthographe, en tenant compte d’indications."},0,6,{"$f":"IF(G12=G11,VLOOKUP(G12,OFFSET(H$7,L11,0,1,1):K$26,4,0),VLOOKUP(G12,H$7:K$26,4,0))","v":6},{"$f":"'Bilan - élève'!U20","v":0},6,{"$f":"IF(J12=J11,VLOOKUP(J12,OFFSET(M$7,O11,0,1,1):N$26,2,0),VLOOKUP(J12,M$7:N$26,2,0))","v":6},{"$f":"Programmes!$B11","v":"Améliorer une production, notamment l’orthographe, en tenant compte d’indications."},{"$f":"'Bilan - classe'!I21","v":""}]
[7,{"$f":"IF(G13=G12,VLOOKUP(G13,OFFSET(H$7,L12,0,1,1):I$26,2,0),VLOOKUP(G13,H$7:I$26,2,0))","v":"Orthographier les mots les plus fréquents et les mots invariables mémorisés."},0,null,null,null,"","",{"$f":"IF(J13=J12,VLOOKUP(J13,OFFSET(M$7,O12,0,1,1):P$26,4,0),VLOOKUP(J13,M$7:P$26,4,0))","v":"Orthographier les mots les plus fréquents et les mots invariables mémorisés."},0,7,{"$f":"IF(G13=G12,VLOOKUP(G13,OFFSET(H$7,L12,0,1,1):K$26,4,0),VLOOKUP(G13,H$7:K$26,4,0))","v":7},{"$f":"'Bilan - élève'!U21","v":0},7,{"$f":"IF(J13=J12,VLOOKUP(J13,OFFSET(M$7,O12,0,1,1):N$26,2,0),VLOOKUP(J13,M$7:N$26,2,0))","v":7},{"$f":"Programmes!$B12","v":"Orthographier les mots les plus fréquents et les mots invariables mémorisés."},{"$f":"'Bilan - classe'!I23","v":""}]
[8,{"$f":"IF(G14=G13,VLOOKUP(G14,OFFSET(H$7,L13,0,1,1):I$26,2,0),VLOOKUP(G14,H$7:I$26,2,0))","v":"Raisonner pour réaliser les accords dans le groupe nominal et entre le verbe et son sujet."},0,null,null,null,"","",{"$f":"IF(J14=J13,VLOOKUP(J14,OFFSET(M$7,O13,0,1,1):P$26,4,0),VLOOKUP(J14,M$7:P$26,4,0))","v":"Raisonner pour réaliser les accords dans le groupe nominal et entre le verbe et son sujet."},0,8,{"$f":"IF(G14=G13,VLOOKUP(G14,OFFSET(H$7,L13,0,1,1):K$26,4,0),VLOOKUP(G14,H$7:K$26,4,0))","v":8},{"$f":"'Bilan - élève'!U22","v":0},8,{"$f":"IF(J14=J13,VLOOKUP(J14,OFFSET(M$7,O13,0,1,1):N$26,2,0),VLOOKUP(J14,M$7:N$26,2,0))","v":8},{"$f":"Programmes!$B13","v":"Raisonner pour réaliser les accords dans le groupe nominal et entre le verbe et son sujet."},{"$f":"'Bilan - classe'!I24","v":""}]
[9,{"$f":"IF(G15=G14,VLOOKUP(G15,OFFSET(H$7,L14,0,1,1):I$26,2,0),VLOOKUP(G15,H$7:I$26,2,0))","v":"Utiliser ses connaissances sur la langue. "},0,null,null,null,"","",{"$f":"IF(J15=J14,VLOOKUP(J15,OFFSET(M$7,O14,0,1,1):P$26,4,0),VLOOKUP(J15,M$7:P$26,4,0))","v":"Utiliser ses connaissances sur la langue. "},0,9,{"$f":"IF(G15=G14,VLOOKUP(G15,OFFSET(H$7,L14,0,1,1):K$26,4,0),VLOOKUP(G15,H$7:K$26,4,0))","v":9},{"$f":"'Bilan - élève'!U23","v":0},9,{"$f":"IF(J15=J14,VLOOKUP(J15,OFFSET(M$7,O14,0,1,1):N$26,2,0),VLOOKUP(J15,M$7:N$26,2,0))","v":9},{"$f":"Programmes!$B14","v":"Utiliser ses connaissances sur la langue. "},{"$f":"'Bilan - classe'!I25","v":""}]
[10,{"$f":"IF(G16=G15,VLOOKUP(G16,OFFSET(H$7,L15,0,1,1):I$26,2,0),VLOOKUP(G16,H$7:I$26,2,0))","v":"Comprendre et utiliser des nombres entiers pour dénombrer, ordonner, repérer, comparer."},0,null,null,null,"","",{"$f":"IF(J16=J15,VLOOKUP(J16,OFFSET(M$7,O15,0,1,1):P$26,4,0),VLOOKUP(J16,M$7:P$26,4,0))","v":"Comprendre et utiliser des nombres entiers pour dénombrer, ordonner, repérer, comparer."},0,10,{"$f":"IF(G16=G15,VLOOKUP(G16,OFFSET(H$7,L15,0,1,1):K$26,4,0),VLOOKUP(G16,H$7:K$26,4,0))","v":10},{"$f":"'Bilan - élève'!U24","v":0},10,{"$f":"IF(J16=J15,VLOOKUP(J16,OFFSET(M$7,O15,0,1,1):N$26,2,0),VLOOKUP(J16,M$7:N$26,2,0))","v":10},{"$f":"Programmes!$B15","v":"Comprendre et utiliser des nombres entiers pour dénombrer, ordonner, repérer, comparer."},{"$f":"'Bilan - classe'!I29","v":""}]
[11,{"$f":"IF(G17=G16,VLOOKUP(G17,OFFSET(H$7,L16,0,1,1):I$26,2,0),VLOOKUP(G17,H$7:I$26,2,0))","v":"Nommer, lire, écrire, représenter des nombres entiers."},0,null,null,null,"","",{"$f":"IF(J17=J16,VLOOKUP(J17,OFFSET(M$7,O16,0,1,1):P$26,4,0),VLOOKUP(J17,M$7:P$26,4,0))","v":"Nommer, lire, écrire, représenter des nombres entiers."},0,11,{"$f":"IF(G17=G16,VLOOKUP(G17,OFFSET(H$7,L16,0,1,1):K$26,4,0),VLOOKUP(G17,H$7:K$26,4,0))","v":11},{"$f":"'Bilan - élève'!U25","v":0},11,{"$f":"IF(J17=J16,VLOOKUP(J17,OFFSET(M$7,O16,0,1,1):N$26,2,0),VLOOKUP(J17,M$7:N$26,2,0))","v":11},{"$f":"Programmes!$B16","v":"Nommer, lire, écrire, représenter des nombres entiers."},{"$f":"'Bilan - classe'!I30","v":""}]
[12,{"$f":"IF(G18=G17,VLOOKUP(G18,OFFSET(H$7,L17,0,1,1):I$26,2,0),VLOOKUP(G18,H$7:I$26,2,0))","v":"Résoudre des problèmes en utilisant des nombres entiers et le calcul."},0,null,null,null,"","",{"$f":"IF(J18=J17,VLOOKUP(J18,OFFSET(M$7,O17,0,1,1):P$26,4,0),VLOOKUP(J18,M$7:P$26,4,0))","v":"Résoudre des problèmes en utilisant des nombres entiers et le calcul."},0,12,{"$f":"IF(G18=G17,VLOOKUP(G18,OFFSET(H$7,L17,0,1,1):K$26,4,0),VLOOKUP(G18,H$7:K$26,4,0))","v":12},{"$f":"'Bilan - élève'!U26","v":0},12,{"$f":"IF(J18=J17,VLOOKUP(J18,OFFSET(M$7,O17,0,1,1):N$26,2,0),VLOOKUP(J18,M$7:N$26,2,0))","v":12},{"$f":"Programmes!$B17","v":"Résoudre des problèmes en utilisant des nombres entiers et le calcul."},{"$f":"'Bilan - classe'!I31","v":""}]
[13,{"$f":"IF(G19=G18,VLOOKUP(G19,OFFSET(H$7,L18,0,1,1):I$26,2,0),VLOOKUP(G19,H$7:I$26,2,0))","v":"Calculer avec des nombres entiers."},0,null,null,null,"","",{"$f":"IF(J19=J18,VLOOKUP(J19,OFFSET(M$7,O18,0,1,1):P$26,4,0),VLOOKUP(J19,M$7:P$26,4,0))","v":"Calculer avec des nombres entiers."},0,13,{"$f":"IF(G19=G18,VLOOKUP(G19,OFFSET(H$7,L18,0,1,1):K$26,4,0),VLOOKUP(G19,H$7:K$26,4,0))","v":13},{"$f":"'Bilan - élève'!U27","v":0},13,{"$f":"IF(J19=J18,VLOOKUP(J19,OFFSET(M$7,O18,0,1,1):N$26,2,0),VLOOKUP(J19,M$7:N$26,2,0))","v":13},{"$f":"Programmes!$B18","v":"Calculer avec des nombres entiers."},{"$f":"'Bilan - classe'!I32","v":""}]
[14,{"$f":"IF(G20=G19,VLOOKUP(G20,OFFSET(H$7,L19,0,1,1):I$26,2,0),VLOOKUP(G20,H$7:I$26,2,0))","v":"Comparer, estimer, mesurer des longueurs, des masses, des contenances, des durées."},0,null,null,null,"","",{"$f":"IF(J20=J19,VLOOKUP(J20,OFFSET(M$7,O19,0,1,1):P$26,4,0),VLOOKUP(J20,M$7:P$26,4,0))","v":"Comparer, estimer, mesurer des longueurs, des masses, des contenances, des durées."},0,14,{"$f":"IF(G20=G19,VLOOKUP(G20,OFFSET(H$7,L19,0,1,1):K$26,4,0),VLOOKUP(G20,H$7:K$26,4,0))","v":14},{"$f":"'Bilan - élève'!U28","v":0},14,{"$f":"IF(J20=J19,VLOOKUP(J20,OFFSET(M$7,O19,0,1,1):N$26,2,0),VLOOKUP(J20,M$7:N$26,2,0))","v":14},{"$f":"Programmes!$B19","v":"Comparer, estimer, mesurer des longueurs, des masses, des contenances, des durées."},{"$f":"'Bilan - classe'!I34","v":""}]
[15,{"$f":"IF(G21=G20,VLOOKUP(G21,OFFSET(H$7,L20,0,1,1):I$26,2,0),VLOOKUP(G21,H$7:I$26,2,0))","v":"Utiliser le lexique, les unités, les instruments de mesures spécifiques de ces grandeurs."},0,null,null,null,"","",{"$f":"IF(J21=J20,VLOOKUP(J21,OFFSET(M$7,O20,0,1,1):P$26,4,0),VLOOKUP(J21,M$7:P$26,4,0))","v":"Utiliser le lexique, les unités, les instruments de mesures spécifiques de ces grandeurs."},0,15,{"$f":"IF(G21=G20,VLOOKUP(G21,OFFSET(H$7,L20,0,1,1):K$26,4,0),VLOOKUP(G21,H$7:K$26,4,0))","v":15},{"$f":"'Bilan - élève'!U29","v":0},15,{"$f":"IF(J21=J20,VLOOKUP(J21,OFFSET(M$7,O20,0,1,1):N$26,2,0),VLOOKUP(J21,M$7:N$26,2,0))","v":15},{"$f":"Programmes!$B20","v":"Utiliser le lexique, les unités, les instruments de mesures spécifiques de ces grandeurs."},{"$f":"'Bilan - classe'!I35","v":""}]
[16,{"$f":"IF(G22=G21,VLOOKUP(G22,OFFSET(H$7,L21,0,1,1):I$26,2,0),VLOOKUP(G22,H$7:I$26,2,0))","v":"Résoudre des problèmes impliquant des longueurs, des masses, des contenances, des durées…"},0,null,null,null,"","",{"$f":"IF(J22=J21,VLOOKUP(J22,OFFSET(M$7,O21,0,1,1):P$26,4,0),VLOOKUP(J22,M$7:P$26,4,0))","v":"Résoudre des problèmes impliquant des longueurs, des masses, des contenances, des durées…"},0,16,{"$f":"IF(G22=G21,VLOOKUP(G22,OFFSET(H$7,L21,0,1,1):K$26,4,0),VLOOKUP(G22,H$7:K$26,4,0))","v":16},{"$f":"'Bilan - élève'!U30","v":0},16,{"$f":"IF(J22=J21,VLOOKUP(J22,OFFSET(M$7,O21,0,1,1):N$26,2,0),VLOOKUP(J22,M$7:N$26,2,0))","v":16},{"$f":"Programmes!$B21","v":"Résoudre des problèmes impliquant des longueurs, des masses, des contenances, des durées…"},{"$f":"'Bilan - classe'!I36","v":""}]
[17,{"$f":"IF(G23=G22,VLOOKUP(G23,OFFSET(H$7,L22,0,1,1):I$26,2,0),VLOOKUP(G23,H$7:I$26,2,0))","v":"(Se) repérer et (se) déplacer en utilisant des repères et des représentations."},0,null,null,null,"","",{"$f":"IF(J23=J22,VLOOKUP(J23,OFFSET(M$7,O22,0,1,1):P$26,4,0),VLOOKUP(J23,M$7:P$26,4,0))","v":"(Se) repérer et (se) déplacer en utilisant des repères et des représentations."},0,17,{"$f":"IF(G23=G22,VLOOKUP(G23,OFFSET(H$7,L22,0,1,1):K$26,4,0),VLOOKUP(G23,H$7:K$26,4,0))","v":17},{"$f":"'Bilan - élève'!U31","v":0},17,{"$f":"IF(J23=J22,VLOOKUP(J23,OFFSET(M$7,O22,0,1,1):N$26,2,0),VLOOKUP(J23,M$7:N$26,2,0))","v":17},{"$f":"Programmes!$B22","v":"(Se) repérer et (se) déplacer en utilisant des repères et des représentations."},{"$f":"'Bilan - classe'!I38","v":""}]
[18,{"$f":"IF(G24=G23,VLOOKUP(G24,OFFSET(H$7,L23,0,1,1):I$26,2,0),VLOOKUP(G24,H$7:I$26,2,0))","v":"Reconnaitre, nommer, décrire, reproduire quelques solides."},0,null,null,null,"","",{"$f":"IF(J24=J23,VLOOKUP(J24,OFFSET(M$7,O23,0,1,1):P$26,4,0),VLOOKUP(J24,M$7:P$26,4,0))","v":"Reconnaitre, nommer, décrire, reproduire quelques solides."},0,18,{"$f":"IF(G24=G23,VLOOKUP(G24,OFFSET(H$7,L23,0,1,1):K$26,4,0),VLOOKUP(G24,H$7:K$26,4,0))","v":18},{"$f":"'Bilan - élève'!U32","v":0},18,{"$f":"IF(J24=J23,VLOOKUP(J24,OFFSET(M$7,O23,0,1,1):N$26,2,0),VLOOKUP(J24,M$7:N$26,2,0))","v":18},{"$f":"Programmes!$B23","v":"Reconnaitre, nommer, décrire, reproduire quelques solides."},{"$f":"'Bilan - classe'!I39","v":""}]
[19,{"$f":"IF(G25=G24,VLOOKUP(G25,OFFSET(H$7,L24,0,1,1):I$26,2,0),VLOOKUP(G25,H$7:I$26,2,0))","v":"Reconnaitre, nommer, décrire, reproduire, construire quelques figures géométriques."},0,null,null,null,"","",{"$f":"IF(J25=J24,VLOOKUP(J25,OFFSET(M$7,O24,0,1,1):P$26,4,0),VLOOKUP(J25,M$7:P$26,4,0))","v":"Reconnaitre, nommer, décrire, reproduire, construire quelques figures géométriques."},0,19,{"$f":"IF(G25=G24,VLOOKUP(G25,OFFSET(H$7,L24,0,1,1):K$26,4,0),VLOOKUP(G25,H$7:K$26,4,0))","v":19},{"$f":"'Bilan - élève'!U33","v":0},19,{"$f":"IF(J25=J24,VLOOKUP(J25,OFFSET(M$7,O24,0,1,1):N$26,2,0),VLOOKUP(J25,M$7:N$26,2,0))","v":19},{"$f":"Programmes!$B24","v":"Reconnaitre, nommer, décrire, reproduire, construire quelques figures géométriques."},{"$f":"'Bilan - classe'!I40","v":""}]
[{"$f":"IF(ISTEXT(B26),A25+1,\"\")","v":20},{"$f":"IF(G26=G25,VLOOKUP(G26,OFFSET(H$7,L25,0,1,1):I$26,2,0),VLOOKUP(G26,H$7:I$26,2,0))","v":"Reconnaitre et utiliser les notions d’alignement, d’angle droit, d’égalité de longueurs, de milieu…"},{"$f":"VLOOKUP(B26,matrice_des_programmes,3,0)","v":0},null,null,null,"","",{"$f":"IF(J26=J25,VLOOKUP(J26,OFFSET(M$7,O25,0,1,1):P$26,4,0),VLOOKUP(J26,M$7:P$26,4,0))","v":"Reconnaitre et utiliser les notions d’alignement, d’angle droit, d’égalité de longueurs, de milieu…"},0,20,{"$f":"IF(G26=G25,VLOOKUP(G26,OFFSET(H$7,L25,0,1,1):K$26,4,0),VLOOKUP(G26,H$7:K$26,4,0))","v":20},{"$f":"'Bilan - élève'!U34","v":0},20,{"$f":"IF(J26=J25,VLOOKUP(J26,OFFSET(M$7,O25,0,1,1):N$26,2,0),VLOOKUP(J26,M$7:N$26,2,0))","v":20},{"$f":"Programmes!$B25","v":"Reconnaitre et utiliser les notions d’alignement, d’angle droit, d’égalité de longueurs, de milieu…"},{"$f":"'Bilan - classe'!I41","v":""}]
[]
["Légende"]
[]
[null,null,null,0,"Taux de réussite inférieur à 50%"]
[null,null,null,50,"Taux de réussite compris entre 50% et 75%"]
[null,null,null,75,"Taux de réussite supérieur ou égal à 75%"]
[]
[]
[{"$f":"Informations!$A$14","v":" : "},null,null,null,null,null,{"$f":"Informations!$B$14","v":" : "}]
[{"$f":"Informations!$A$15","v":""},null,null,null,null,null,{"$f":"Informations!$B$2","v":"2016-2017"}]

{"sheet":"Réussites - classe","index":10,"n_rows":37,"n_cols":16,"rows_kept":37,"cut":false,"hidden":false,"merged":[[0,0,0,5],[1,0,1,5],[2,0,2,5],[28,0,28,6],[5,1,5,4]]}
["RÉUSSITES AUX ATTENDUS"]
[{"$f":"\"Classe de \" & Informations!B7","v":"Classe de "}]
["Évaluation diagnostique d'entrée en CE2"]
[]
[]
[null,"Compétences",null,null,null,"%",null,null,"Difficulté 2","Numéro 1","Numéro 2","Difficulté 1","Numéro 1","Numéro 2"]
[1,{"$f":"VLOOKUP(F7,G$7:H$26,2,0)","v":"Conserver une attention soutenue et manifester, si besoin et à bon escient, son incompréhension."},null,null,null,{"$f":"IF(ROW(F7)-6>COUNT(G$7:G$26),\"\",LARGE(G$7:G$26,ROW(F7)-6))","v":""},{"$f":"VLOOKUP(H7,O$7:P$26,2,0)","v":""},{"$f":"VLOOKUP(I7,L$7:O$26,4,0)","v":"Conserver une attention soutenue et manifester, si besoin et à bon escient, son incompréhension."},{"$f":"IF(ROW(I7)-6>COUNT(L$7:L$26),\"\",LARGE(L$7:L$26,ROW(I7)-6))","v":0},1,{"$f":"VLOOKUP(F7,G$7:J$26,4,0)","v":1},{"$f":"'Bilan - élève'!T10","v":0},1,{"$f":"VLOOKUP(I7,L$7:M$26,2,0)","v":1},{"$f":"Programmes!$B2","v":"Conserver une attention soutenue et manifester, si besoin et à bon escient, son incompréhension."},{"$f":"'Bilan - classe'!I10","v":""}]
[{"$f":"IF(ISTEXT(B8),A7+1,\"\")","v":2},{"$f":"IF(F8=F7,VLOOKUP(F8,OFFSET(G$7,K7,0,1,1):H$26,2,0),VLOOKUP(F8,G$7:H$26,2,0))","v":"Lire et comprendre des textes adaptés à la maturité et à la culture scolaire des élèves."},null,null,null,"","",{"$f":"IF(I8=I7,VLOOKUP(I8,OFFSET(L$7,N7,0,1,1):O$26,4,0),VLOOKUP(I8,L$7:O$26,4,0))","v":"Lire et comprendre des textes adaptés à la maturité et à la culture scolaire des élèves."},0,2,{"$f":"IF(F8=F7,VLOOKUP(F8,OFFSET(G$7,K7,0,1,1):J$26,4,0),VLOOKUP(F8,G$7:J$26,4,0))","v":2},{"$f":"'Bilan - élève'!T16","v":0},2,{"$f":"IF(I8=I7,VLOOKUP(I8,OFFSET(L$7,N7,0,1,1):M$26,2,0),VLOOKUP(I8,L$7:M$26,2,0))","v":2},{"$f":"Programmes!$B7","v":"Lire et comprendre des textes adaptés à la maturité et à la culture scolaire des élèves."},{"$f":"'Bilan - classe'!I16","v":""}]
[{"$f":"IF(ISTEXT(B9),A8+1,\"\")","v":3},{"$f":"IF(F9=F8,VLOOKUP(F9,OFFSET(G$7,K8,0,1,1):H$26,2,0),VLOOKUP(F9,G$7:H$26,2,0))","v":"Lire à voix haute avec fluidité, après préparation, un texte d’une demi-page."},null,null,null,"","",{"$f":"IF(I9=I8,VLOOKUP(I9,OFFSET(L$7,N8,0,1,1):O$26,4,0),VLOOKUP(I9,L$7:O$26,4,0))","v":"Lire à voix haute avec fluidité, après préparation, un texte d’une demi-page."},0,3,{"$f":"IF(F9=F8,VLOOKUP(F9,OFFSET(G$7,K8,0,1,1):J$26,4,0),VLOOKUP(F9,G$7:J$26,4,0))","v":3},{"$f":"'Bilan - élève'!T17","v":0},3,{"$f":"IF(I9=I8,VLOOKUP(I9,OFFSET(L$7,N8,0,1,1):M$26,2,0),VLOOKUP(I9,L$7:M$26,2,0))","v":3},{"$f":"Programmes!$B8","v":"Lire à voix haute avec fluidité, après préparation, un texte d’une demi-page."},{"$f":"'Bilan - classe'!I17","v":""}]
[4,{"$f":"IF(F10=F9,VLOOKUP(F10,OFFSET(G$7,K9,0,1,1):H$26,2,0),VLOOKUP(F10,G$7:H$26,2,0))","v":"Copier ou transcrire, dans une écriture lisible, un texte d’une dizaine de lignes."},null,null,null,"","",{"$f":"IF(I10=I9,VLOOKUP(I10,OFFSET(L$7,N9,0,1,1):O$26,4,0),VLOOKUP(I10,L$7:O$26,4,0))","v":"Copier ou transcrire, dans une écriture lisible, un texte d’une dizaine de lignes."},0,4,{"$f":"IF(F10=F9,VLOOKUP(F10,OFFSET(G$7,K9,0,1,1):J$26,4,0),VLOOKUP(F10,G$7:J$26,4,0))","v":4},{"$f":"'Bilan - élève'!T18","v":0},4,{"$f":"IF(I10=I9,VLOOKUP(I10,OFFSET(L$7,N9,0,1,1):M$26,2,0),VLOOKUP(I10,L$7:M$26,2,0))","v":4},{"$f":"Programmes!$B9","v":"Copier ou transcrire, dans une écriture lisible, un texte d’une dizaine de lignes."},{"$f":"'Bilan - classe'!I19","v":""}]
[5,{"$f":"IF(F11=F10,VLOOKUP(F11,OFFSET(G$7,K10,0,1,1):H$26,2,0),VLOOKUP(F11,G$7:H$26,2,0))","v":"Rédiger un texte d’environ une demi-page, cohérent, organisé, ponctué, pertinent."},null,null,null,"","",{"$f":"IF(I11=I10,VLOOKUP(I11,OFFSET(L$7,N10,0,1,1):O$26,4,0),VLOOKUP(I11,L$7:O$26,4,0))","v":"Rédiger un texte d’environ une demi-page, cohérent, organisé, ponctué, pertinent."},0,5,{"$f":"IF(F11=F10,VLOOKUP(F11,OFFSET(G$7,K10,0,1,1):J$26,4,0),VLOOKUP(F11,G$7:J$26,4,0))","v":5},{"$f":"'Bilan - élève'!T19","v":0},5,{"$f":"IF(I11=I10,VLOOKUP(I11,OFFSET(L$7,N10,0,1,1):M$26,2,0),VLOOKUP(I11,L$7:M$26,2,0))","v":5},{"$f":"Programmes!$B10","v":"Rédiger un texte d’environ une demi-page, cohérent, organisé, ponctué, pertinent."},{"$f":"'Bilan - classe'!I20","v":""}]
[6,{"$f":"IF(F12=F11,VLOOKUP(F12,OFFSET(G$7,K11,0,1,1):H$26,2,0),VLOOKUP(F12,G$7:H$26,2,0))","v":"Améliorer une production, notamment l’orthographe, en tenant compte d’indications."},null,null,null,"","",{"$f":"IF(I12=I11,VLOOKUP(I12,OFFSET(L$7,N11,0,1,1):O$26,4,0),VLOOKUP(I12,L$7:O$26,4,0))","v":"Améliorer une production, notamment l’orthographe, en tenant compte d’indications."},0,6,{"$f":"IF(F12=F11,VLOOKUP(F12,OFFSET(G$7,K11,0,1,1):J$26,4,0),VLOOKUP(F12,G$7:J$26,4,0))","v":6},{"$f":"'Bilan - élève'!T20","v":0},6,{"$f":"IF(I12=I11,VLOOKUP(I12,OFFSET(L$7,N11,0,1,1):M$26,2,0),VLOOKUP(I12,L$7:M$26,2,0))","v":6},{"$f":"Programmes!$B11","v":"Améliorer une production, notamment l’orthographe, en tenant compte d’indications."},{"$f":"'Bilan - classe'!I21","v":""}]
[7,{"$f":"IF(F13=F12,VLOOKUP(F13,OFFSET(G$7,K12,0,1,1):H$26,2,0),VLOOKUP(F13,G$7:H$26,2,0))","v":"Orthographier les mots les plus fréquents et les mots invariables mémorisés."},null,null,null,"","",{"$f":"IF(I13=I12,VLOOKUP(I13,OFFSET(L$7,N12,0,1,1):O$26,4,0),VLOOKUP(I13,L$7:O$26,4,0))","v":"Orthographier les mots les plus fréquents et les mots invariables mémorisés."},0,7,{"$f":"IF(F13=F12,VLOOKUP(F13,OFFSET(G$7,K12,0,1,1):J$26,4,0),VLOOKUP(F13,G$7:J$26,4,0))","v":7},{"$f":"'Bilan - élève'!T21","v":0},7,{"$f":"IF(I13=I12,VLOOKUP(I13,OFFSET(L$7,N12,0,1,1):M$26,2,0),VLOOKUP(I13,L$7:M$26,2,0))","v":7},{"$f":"Programmes!$B12","v":"Orthographier les mots les plus fréquents et les mots invariables mémorisés."},{"$f":"'Bilan - classe'!I23","v":""}]
[8,{"$f":"IF(F14=F13,VLOOKUP(F14,OFFSET(G$7,K13,0,1,1):H$26,2,0),VLOOKUP(F14,G$7:H$26,2,0))","v":"Raisonner pour réaliser les accords dans le groupe nominal et entre le verbe et son sujet."},null,null,null,"","",{"$f":"IF(I14=I13,VLOOKUP(I14,OFFSET(L$7,N13,0,1,1):O$26,4,0),VLOOKUP(I14,L$7:O$26,4,0))","v":"Raisonner pour réaliser les accords dans le groupe nominal et entre le verbe et son sujet."},0,8,{"$f":"IF(F14=F13,VLOOKUP(F14,OFFSET(G$7,K13,0,1,1):J$26,4,0),VLOOKUP(F14,G$7:J$26,4,0))","v":8},{"$f":"'Bilan - élève'!T22","v":0},8,{"$f":"IF(I14=I13,VLOOKUP(I14,OFFSET(L$7,N13,0,1,1):M$26,2,0),VLOOKUP(I14,L$7:M$26,2,0))","v":8},{"$f":"Programmes!$B13","v":"Raisonner pour réaliser les accords dans le groupe nominal et entre le verbe et son sujet."},{"$f":"'Bilan - classe'!I24","v":""}]
[9,{"$f":"IF(F15=F14,VLOOKUP(F15,OFFSET(G$7,K14,0,1,1):H$26,2,0),VLOOKUP(F15,G$7:H$26,2,0))","v":"Utiliser ses connaissances sur la langue. "},null,null,null,"","",{"$f":"IF(I15=I14,VLOOKUP(I15,OFFSET(L$7,N14,0,1,1):O$26,4,0),VLOOKUP(I15,L$7:O$26,4,0))","v":"Utiliser ses connaissances sur la langue. "},0,9,{"$f":"IF(F15=F14,VLOOKUP(F15,OFFSET(G$7,K14,0,1,1):J$26,4,0),VLOOKUP(F15,G$7:J$26,4,0))","v":9},{"$f":"'Bilan - élève'!T23","v":0},9,{"$f":"IF(I15=I14,VLOOKUP(I15,OFFSET(L$7,N14,0,1,1):M$26,2,0),VLOOKUP(I15,L$7:M$26,2,0))","v":9},{"$f":"Programmes!$B14","v":"Utiliser ses connaissances sur la langue. "},{"$f":"'Bilan - classe'!I25","v":""}]
[10,{"$f":"IF(F16=F15,VLOOKUP(F16,OFFSET(G$7,K15,0,1,1):H$26,2,0),VLOOKUP(F16,G$7:H$26,2,0))","v":"Comprendre et utiliser des nombres entiers pour dénombrer, ordonner, repérer, comparer."},null,null,null,"","",{"$f":"IF(I16=I15,VLOOKUP(I16,OFFSET(L$7,N15,0,1,1):O$26,4,0),VLOOKUP(I16,L$7:O$26,4,0))","v":"Comprendre et utiliser des nombres entiers pour dénombrer, ordonner, repérer, comparer."},0,10,{"$f":"IF(F16=F15,VLOOKUP(F16,OFFSET(G$7,K15,0,1,1):J$26,4,0),VLOOKUP(F16,G$7:J$26,4,0))","v":10},{"$f":"'Bilan - élève'!T24","v":0},10,{"$f":"IF(I16=I15,VLOOKUP(I16,OFFSET(L$7,N15,0,1,1):M$26,2,0),VLOOKUP(I16,L$7:M$26,2,0))","v":10},{"$f":"Programmes!$B15","v":"Comprendre et utiliser des nombres entiers pour dénombrer, ordonner, repérer, comparer."},{"$f":"'Bilan - classe'!I29","v":""}]
[11,{"$f":"IF(F17=F16,VLOOKUP(F17,OFFSET(G$7,K16,0,1,1):H$26,2,0),VLOOKUP(F17,G$7:H$26,2,0))","v":"Nommer, lire, écrire, représenter des nombres entiers."},null,null,null,"","",{"$f":"IF(I17=I16,VLOOKUP(I17,OFFSET(L$7,N16,0,1,1):O$26,4,0),VLOOKUP(I17,L$7:O$26,4,0))","v":"Nommer, lire, écrire, représenter des nombres entiers."},0,11,{"$f":"IF(F17=F16,VLOOKUP(F17,OFFSET(G$7,K16,0,1,1):J$26,4,0),VLOOKUP(F17,G$7:J$26,4,0))","v":11},{"$f":"'Bilan - élève'!T25","v":0},11,{"$f":"IF(I17=I16,VLOOKUP(I17,OFFSET(L$7,N16,0,1,1):M$26,2,0),VLOOKUP(I17,L$7:M$26,2,0))","v":11},{"$f":"Programmes!$B16","v":"Nommer, lire, écrire, représenter des nombres entiers."},{"$f":"'Bilan - classe'!I30","v":""}]
[12,{"$f":"IF(F18=F17,VLOOKUP(F18,OFFSET(G$7,K17,0,1,1):H$26,2,0),VLOOKUP(F18,G$7:H$26,2,0))","v":"Résoudre des problèmes en utilisant des nombres entiers et le calcul."},null,null,null,"","",{"$f":"IF(I18=I17,VLOOKUP(I18,OFFSET(L$7,N17,0,1,1):O$26,4,0),VLOOKUP(I18,L$7:O$26,4,0))","v":"Résoudre des problèmes en utilisant des nombres entiers et le calcul."},0,12,{"$f":"IF(F18=F17,VLOOKUP(F18,OFFSET(G$7,K17,0,1,1):J$26,4,0),VLOOKUP(F18,G$7:J$26,4,0))","v":12},{"$f":"'Bilan - élève'!T26","v":0},12,{"$f":"IF(I18=I17,VLOOKUP(I18,OFFSET(L$7,N17,0,1,1):M$26,2,0),VLOOKUP(I18,L$7:M$26,2,0))","v":12},{"$f":"Programmes!$B17","v":"Résoudre des problèmes en utilisant des nombres entiers et le calcul."},{"$f":"'Bilan - classe'!I31","v":""}]
[13,{"$f":"IF(F19=F18,VLOOKUP(F19,OFFSET(G$7,K18,0,1,1):H$26,2,0),VLOOKUP(F19,G$7:H$26,2,0))","v":"Calculer avec des nombres entiers."},null,null,null,"","",{"$f":"IF(I19=I18,VLOOKUP(I19,OFFSET(L$7,N18,0,1,1):O$26,4,0),VLOOKUP(I19,L$7:O$26,4,0))","v":"Calculer avec des nombres entiers."},0,13,{"$f":"IF(F19=F18,VLOOKUP(F19,OFFSET(G$7,K18,0,1,1):J$26,4,0),VLOOKUP(F19,G$7:J$26,4,0))","v":13},{"$f":"'Bilan - élève'!T27","v":0},13,{"$f":"IF(I19=I18,VLOOKUP(I19,OFFSET(L$7,N18,0,1,1):M$26,2,0),VLOOKUP(I19,L$7:M$26,2,0))","v":13},{"$f":"Programmes!$B18","v":"Calculer avec des nombres entiers."},{"$f":"'Bilan - classe'!I32","v":""}]
[14,{"$f":"IF(F20=F19,VLOOKUP(F20,OFFSET(G$7,K19,0,1,1):H$26,2,0),VLOOKUP(F20,G$7:H$26,2,0))","v":"Comparer, estimer, mesurer des longueurs, des masses, des contenances, des durées."},null,null,null,"","",{"$f":"IF(I20=I19,VLOOKUP(I20,OFFSET(L$7,N19,0,1,1):O$26,4,0),VLOOKUP(I20,L$7:O$26,4,0))","v":"Comparer, estimer, mesurer des longueurs, des masses, des contenances, des durées."},0,14,{"$f":"IF(F20=F19,VLOOKUP(F20,OFFSET(G$7,K19,0,1,1):J$26,4,0),VLOOKUP(F20,G$7:J$26,4,0))","v":14},{"$f":"'Bilan - élève'!T28","v":0},14,{"$f":"IF(I20=I19,VLOOKUP(I20,OFFSET(L$7,N19,0,1,1):M$26,2,0),VLOOKUP(I20,L$7:M$26,2,0))","v":14},{"$f":"Programmes!$B19","v":"Comparer, estimer, mesurer des longueurs, des masses, des contenances, des durées."},{"$f":"'Bilan - classe'!I34","v":""}]
[15,{"$f":"IF(F21=F20,VLOOKUP(F21,OFFSET(G$7,K20,0,1,1):H$26,2,0),VLOOKUP(F21,G$7:H$26,2,0))","v":"Utiliser le lexique, les unités, les instruments de mesures spécifiques de ces grandeurs."},null,null,null,"","",{"$f":"IF(I21=I20,VLOOKUP(I21,OFFSET(L$7,N20,0,1,1):O$26,4,0),VLOOKUP(I21,L$7:O$26,4,0))","v":"Utiliser le lexique, les unités, les instruments de mesures spécifiques de ces grandeurs."},0,15,{"$f":"IF(F21=F20,VLOOKUP(F21,OFFSET(G$7,K20,0,1,1):J$26,4,0),VLOOKUP(F21,G$7:J$26,4,0))","v":15},{"$f":"'Bilan - élève'!T29","v":0},15,{"$f":"IF(I21=I20,VLOOKUP(I21,OFFSET(L$7,N20,0,1,1):M$26,2,0),VLOOKUP(I21,L$7:M$26,2,0))","v":15},{"$f":"Programmes!$B20","v":"Utiliser le lexique, les unités, les instruments de mesures spécifiques de ces grandeurs."},{"$f":"'Bilan - classe'!I35","v":""}]
[16,{"$f":"IF(F22=F21,VLOOKUP(F22,OFFSET(G$7,K21,0,1,1):H$26,2,0),VLOOKUP(F22,G$7:H$26,2,0))","v":"Résoudre des problèmes impliquant des longueurs, des masses, des contenances, des durées…"},null,null,null,"","",{"$f":"IF(I22=I21,VLOOKUP(I22,OFFSET(L$7,N21,0,1,1):O$26,4,0),VLOOKUP(I22,L$7:O$26,4,0))","v":"Résoudre des problèmes impliquant des longueurs, des masses, des contenances, des durées…"},0,16,{"$f":"IF(F22=F21,VLOOKUP(F22,OFFSET(G$7,K21,0,1,1):J$26,4,0),VLOOKUP(F22,G$7:J$26,4,0))","v":16},{"$f":"'Bilan - élève'!T30","v":0},16,{"$f":"IF(I22=I21,VLOOKUP(I22,OFFSET(L$7,N21,0,1,1):M$26,2,0),VLOOKUP(I22,L$7:M$26,2,0))","v":16},{"$f":"Programmes!$B21","v":"Résoudre des problèmes impliquant des longueurs, des masses, des contenances, des durées…"},{"$f":"'Bilan - classe'!I36","v":""}]
[17,{"$f":"IF(F23=F22,VLOOKUP(F23,OFFSET(G$7,K22,0,1,1):H$26,2,0),VLOOKUP(F23,G$7:H$26,2,0))","v":"(Se) repérer et (se) déplacer en utilisant des repères et des représentations."},null,null,null,"","",{"$f":"IF(I23=I22,VLOOKUP(I23,OFFSET(L$7,N22,0,1,1):O$26,4,0),VLOOKUP(I23,L$7:O$26,4,0))","v":"(Se) repérer et (se) déplacer en utilisant des repères et des représentations."},0,17,{"$f":"IF(F23=F22,VLOOKUP(F23,OFFSET(G$7,K22,0,1,1):J$26,4,0),VLOOKUP(F23,G$7:J$26,4,0))","v":17},{"$f":"'Bilan - élève'!T31","v":0},17,{"$f":"IF(I23=I22,VLOOKUP(I23,OFFSET(L$7,N22,0,1,1):M$26,2,0),VLOOKUP(I23,L$7:M$26,2,0))","v":17},{"$f":"Programmes!$B22","v":"(Se) repérer et (se) déplacer en utilisant des repères et des représentations."},{"$f":"'Bilan - classe'!I38","v":""}]
[18,{"$f":"IF(F24=F23,VLOOKUP(F24,OFFSET(G$7,K23,0,1,1):H$26,2,0),VLOOKUP(F24,G$7:H$26,2,0))","v":"Reconnaitre, nommer, décrire, reproduire quelques solides."},null,null,null,"","",{"$f":"IF(I24=I23,VLOOKUP(I24,OFFSET(L$7,N23,0,1,1):O$26,4,0),VLOOKUP(I24,L$7:O$26,4,0))","v":"Reconnaitre, nommer, décrire, reproduire quelques solides."},0,18,{"$f":"IF(F24=F23,VLOOKUP(F24,OFFSET(G$7,K23,0,1,1):J$26,4,0),VLOOKUP(F24,G$7:J$26,4,0))","v":18},{"$f":"'Bilan - élève'!T32","v":0},18,{"$f":"IF(I24=I23,VLOOKUP(I24,OFFSET(L$7,N23,0,1,1):M$26,2,0),VLOOKUP(I24,L$7:M$26,2,0))","v":18},{"$f":"Programmes!$B23","v":"Reconnaitre, nommer, décrire, reproduire quelques solides."},{"$f":"'Bilan - classe'!I39","v":""}]
[19,{"$f":"IF(F25=F24,VLOOKUP(F25,OFFSET(G$7,K24,0,1,1):H$26,2,0),VLOOKUP(F25,G$7:H$26,2,0))","v":"Reconnaitre, nommer, décrire, reproduire, construire quelques figures géométriques."},null,null,null,"","",{"$f":"IF(I25=I24,VLOOKUP(I25,OFFSET(L$7,N24,0,1,1):O$26,4,0),VLOOKUP(I25,L$7:O$26,4,0))","v":"Reconnaitre, nommer, décrire, reproduire, construire quelques figures géométriques."},0,19,{"$f":"IF(F25=F24,VLOOKUP(F25,OFFSET(G$7,K24,0,1,1):J$26,4,0),VLOOKUP(F25,G$7:J$26,4,0))","v":19},{"$f":"'Bilan - élève'!T33","v":0},19,{"$f":"IF(I25=I24,VLOOKUP(I25,OFFSET(L$7,N24,0,1,1):M$26,2,0),VLOOKUP(I25,L$7:M$26,2,0))","v":19},{"$f":"Programmes!$B24","v":"Reconnaitre, nommer, décrire, reproduire, construire quelques figures géométriques."},{"$f":"'Bilan - classe'!I40","v":""}]
[{"$f":"IF(ISTEXT(B26),A25+1,\"\")","v":20},{"$f":"IF(F26=F25,VLOOKUP(F26,OFFSET(G$7,K25,0,1,1):H$26,2,0),VLOOKUP(F26,G$7:H$26,2,0))","v":"Reconnaitre et utiliser les notions d’alignement, d’angle droit, d’égalité de longueurs, de milieu…"},null,null,null,"","",{"$f":"IF(I26=I25,VLOOKUP(I26,OFFSET(L$7,N25,0,1,1):O$26,4,0),VLOOKUP(I26,L$7:O$26,4,0))","v":"Reconnaitre et utiliser les notions d’alignement, d’angle droit, d’égalité de longueurs, de milieu…"},0,20,{"$f":"IF(F26=F25,VLOOKUP(F26,OFFSET(G$7,K25,0,1,1):J$26,4,0),VLOOKUP(F26,G$7:J$26,4,0))","v":20},{"$f":"'Bilan - élève'!T34","v":0},20,{"$f":"IF(I26=I25,VLOOKUP(I26,OFFSET(L$7,N25,0,1,1):M$26,2,0),VLOOKUP(I26,L$7:M$26,2,0))","v":20},{"$f":"Programmes!$B25","v":"Reconnaitre et utiliser les notions d’alignement, d’angle droit, d’égalité de longueurs, de milieu…"},{"$f":"'Bilan - classe'!I41","v":""}]
[]
[]
["Légende"]
[]
[null,null,0,"Taux de réussite inférieur à 50%"]
[null,null,50,"Taux de réussite compris entre 50% et 75%"]
[null,null,75,"Taux de réussite supérieur ou égal à 75%"]
[]
[]
[{"$f":"Informations!$A$14","v":" : "},null,null,null,null,{"$f":"Informations!$B$14","v":" : "}]
[{"$f":"Informations!$A$15","v":""},null,null,null,null,{"$f":"Informations!$B$2","v":"2016-2017"}]

{"sheet":"Synthèse - classe","index":11,"n_rows":53,"n_cols":6,"rows_kept":53,"cut":false,"hidden":false,"merged":[[4,2,4,3],[4,4,4,5],[0,0,0,5],[1,0,1,5],[2,0,2,5]]}
["SYNTHÈSE DES RÉSULTATS"]
[{"$f":"\"Classe de \" & Informations!B7","v":"Classe de "}]
["Évaluation diagnostique d'entrée en CE2"]
[]
[]
[null,"Élèves","Total","Français","Total","Mathématiques"]
[1,{"$f":"Élèves!B2 & \" \" & Élèves!C2","v":" "},{"$f":"IF(COUNT(INDEX(liste_francais,,A7))>0,SUM(INDEX(liste_francais,,A7)),\"\")","v":""},{"$f":"IF(ISNUMBER(C7),C7/(INDEX(liste_francais_total,,A7)*3),\"\")","v":""},{"$f":"IF(COUNT(INDEX(liste_maths,,A7))>0,SUM(INDEX(liste_maths,,A7)),\"\")","v":""},{"$f":"IF(ISNUMBER(E7),E7/(INDEX(liste_maths_total,,A7)*3),\"\")","v":""}]
[{"$f":"IF(ISTEXT(B8),A7+1,\"\")","v":2},{"$f":"Élèves!B3 & \" \" & Élèves!C3","v":" "},"","","",""]
[{"$f":"IF(ISTEXT(B9),A8+1,\"\")","v":3},{"$f":"Élèves!B4 & \" \" & Élèves!C4","v":" "},"","","",""]
[4,{"$f":"Élèves!B5 & \" \" & Élèves!C5","v":" "},"","","",""]
[5,{"$f":"Élèves!B6 & \" \" & Élèves!C6","v":" "},"","","",""]
[6,{"$f":"Élèves!B7 & \" \" & Élèves!C7","v":" "},"","","",""]
[7,{"$f":"Élèves!B8 & \" \" & Élèves!C8","v":" "},"","","",""]
[8,{"$f":"Élèves!B9 & \" \" & Élèves!C9","v":" "},"","","",""]
[9,{"$f":"Élèves!B10 & \" \" & Élèves!C10","v":" "},"","","",""]
[10,{"$f":"Élèves!B11 & \" \" & Élèves!C11","v":" "},"","","",""]
[11,{"$f":"Élèves!B12 & \" \" & Élèves!C12","v":" "},"","","",""]
[12,{"$f":"Élèves!B13 & \" \" & Élèves!C13","v":" "},"","","",""]
[13,{"$f":"Élèves!B14 & \" \" & Élèves!C14","v":" "},"","","",""]
[14,{"$f":"Élèves!B15 & \" \" & Élèves!C15","v":" "},"","","",""]
[15,{"$f":"Élèves!B16 & \" \" & Élèves!C16","v":" "},"","","",""]
[16,{"$f":"Élèves!B17 & \" \" & Élèves!C17","v":" "},"","","",""]
[17,{"$f":"Élèves!B18 & \" \" & Élèves!C18","v":" "},"","","",""]
[18,{"$f":"Élèves!B19 & \" \" & Élèves!C19","v":" "},"","","",""]
[19,{"$f":"Élèves!B20 & \" \" & Élèves!C20","v":" "},"","","",""]
[20,{"$f":"Élèves!B21 & \" \" & Élèves!C21","v":" "},"","","",""]
[21,{"$f":"Élèves!B22 & \" \" & Élèves!C22","v":" "},"","","",""]
[22,{"$f":"Élèves!B23 & \" \" & Élèves!C23","v":" "},"","","",""]
[23,{"$f":"Élèves!B24 & \" \" & Élèves!C24","v":" "},"","","",""]
[24,{"$f":"Élèves!B25 & \" \" & Élèves!C25","v":" "},"","","",""]
[25,{"$f":"Élèves!B26 & \" \" & Élèves!C26","v":" "},"","","",""]
[26,{"$f":"Élèves!B27 & \" \" & Élèves!C27","v":" "},"","","",""]
[27,{"$f":"Élèves!B28 & \" \" & Élèves!C28","v":" "},"","","",""]
[28,{"$f":"Élèves!B29 & \" \" & Élèves!C29","v":" "},"","","",""]
[29,{"$f":"Élèves!B30 & \" \" & Élèves!C30","v":" "},"","","",""]
[30,{"$f":"Élèves!B31 & \" \" & Élèves!C31","v":" "},"","","",""]
[31,{"$f":"Élèves!B32 & \" \" & Élèves!C32","v":" "},"","","",""]
[32,{"$f":"Élèves!B33 & \" \" & Élèves!C33","v":" "},"","","",""]
[33,{"$f":"Élèves!B34 & \" \" & Élèves!C34","v":" "},"","","",""]
[34,{"$f":"Élèves!B35 & \" \" & Élèves!C35","v":" "},"","","",""]
[35,{"$f":"Élèves!B36 & \" \" & Élèves!C36","v":" "},"","","",""]
[]
[null,"Moyenne",{"$f":"IF(COUNT(C7:C41)>0,AVERAGE(C$7:C$41),\"\")","v":""},{"$f":"IF(COUNT(D7:D41)>0,AVERAGE(D$7:D$41),\"\")","v":""},{"$f":"IF(COUNT(E7:E41)>0,AVERAGE(E$7:E$41),\"\")","v":""},{"$f":"IF(COUNT(F7:F41)>0,AVERAGE(F$7:F$41),\"\")","v":""}]
[null,"Médiane",{"$f":"IF(COUNT(C8:C42)>0,MEDIAN(C$7:C$41),\"\")","v":""},{"$f":"IF(COUNT(D8:D42)>0,MEDIAN(D$7:D$41),\"\")","v":""},{"$f":"IF(COUNT(E8:E42)>0,MEDIAN(E$7:E$41),\"\")","v":""},{"$f":"IF(COUNT(F8:F42)>0,MEDIAN(F$7:F$41),\"\")","v":""}]
[null,"Écart-type",{"$f":"IF(COUNT(C9:C43)>0,STDEVP(C$7:C$41),\"\")","v":""},{"$f":"IF(COUNT(D9:D43)>0,STDEVP(D$7:D$41),\"\")","v":""},{"$f":"IF(COUNT(E9:E43)>0,STDEVP(E$7:E$41),\"\")","v":""},{"$f":"IF(COUNT(F9:F43)>0,STDEVP(F$7:F$41),\"\")","v":""}]
[]
[]
[]
[]
[]
[]
[{"$f":"Informations!$A$14","v":" : "},null,null,null,null,{"$f":"Informations!$B$14","v":" : "}]
[{"$f":"Informations!$A$15","v":""},null,null,null,null,{"$f":"Informations!$B$2","v":"2016-2017"}]

{"sheet":"Profil - classe","index":12,"n_rows":49,"n_cols":8,"rows_kept":49,"cut":false,"hidden":false,"merged":[[3,0,3,7],[0,0,0,6]]}
[{"$f":"\"CLASSE DE \" & UPPER(Informations!B7)","v":"CLASSE DE "},null,null,null,null,null,null,"CE2"]
["Académie de Paris",null,null,null,null,null,null,{"$f":"IF(ISBLANK(Informations!$B$2),\"\",Informations!$B$2)","v":"2016-2017"}]
[]
["PROFIL DE LA CLASSE D'APRÈS L'ÉVALUATION DIAGNOSTIQUE"]
[]
[]
[]
[]
[]
[]
[]
[]
[]
[]
[]
[]
[]
[]
[]
[]
[]
[]
[]
[]
[]
[]
[]
[]
[]
[]
[]
[]
[]
[]
[]
[]
[]
[]
[]
[]
[]
[]
[]
[]
[]
[]
[]
[{"$f":"Informations!$A$14","v":" : "},null,null,null,null,null,null,{"$f":"Informations!$B$14","v":" : "}]
[{"$f":"Informations!$A$15","v":""},null,null,null,null,null,null,{"$f":"Informations!$B$15","v":""}]

{"sheet":"Répartition","index":13,"n_rows":17,"n_cols":9,"rows_kept":17,"cut":false,"hidden":true,"merged":[[0,0,0,8],[1,0,1,8],[2,0,2,8],[5,0,5,3],[5,5,5,8]]}
["RÉPARTITION DES RÉSULTATS"]
[{"$f":"\"Classe de \" & Informations!B7","v":"Classe de "}]
["Évaluation diagnostique d'entrée en CE2"]
[]
[]
["Français",null,null,null,null,"Mathématiques"]
["Borne basse","Borne haute","Intervalle",{"$f":"\"Nombre d'élèves de la classe pour chaque intervalle\"","v":"Nombre d'élèves de la classe pour chaque intervalle"},null,"Borne basse","Borne haute","Intervalle","Nombre d'élèves de la classe pour chaque intervalle"]
[0,0.1,{"$f":"\"De \" & A8*100 & \"% à \" & B8*100 & \"%\"","v":"De 0% à 10%"},{"$f":"COUNTIF('Synthèse - classe'!$D$7:$D$41,\">=\"&A8)-COUNTIF('Synthèse - classe'!$D$7:$D$41,\">=\"&B8)","v":0},null,0,0.1,{"$f":"\"De \" & F8*100 & \"% à \" & G8*100 & \"%\"","v":"De 0% à 10%"},{"$f":"COUNTIF('Synthèse - classe'!$F$7:$F$41,\">=\"&F8)-COUNTIF('Synthèse - classe'!$F$7:$F$41,\">=\"&G8)","v":0}]
[0.1,0.2,{"$f":"\"De \" & A9*100 & \"% à \" & B9*100 & \"%\"","v":"De 10% à 20%"},{"$f":"COUNTIF('Synthèse - classe'!$D$7:$D$41,\">=\"&A9)-COUNTIF('Synthèse - classe'!$D$7:$D$41,\">=\"&B9)","v":0},null,0.1,0.2,{"$f":"\"De \" & F9*100 & \"% à \" & G9*100 & \"%\"","v":"De 10% à 20%"},{"$f":"COUNTIF('Synthèse - classe'!$F$7:$F$41,\">=\"&F9)-COUNTIF('Synthèse - classe'!$F$7:$F$41,\">=\"&G9)","v":0}]
[0.2,0.3,{"$f":"\"De \" & A10*100 & \"% à \" & B10*100 & \"%\"","v":"De 20% à 30%"},{"$f":"COUNTIF('Synthèse - classe'!$D$7:$D$41,\">=\"&A10)-COUNTIF('Synthèse - classe'!$D$7:$D$41,\">=\"&B10)","v":0},null,0.2,0.3,{"$f":"\"De \" & F10*100 & \"% à \" & G10*100 & \"%\"","v":"De 20% à 30%"},{"$f":"COUNTIF('Synthèse - classe'!$F$7:$F$41,\">=\"&F10)-COUNTIF('Synthèse - classe'!$F$7:$F$41,\">=\"&G10)","v":0}]
[0.3,0.4,"De 30% à 40%",{"$f":"COUNTIF('Synthèse - classe'!$D$7:$D$41,\">=\"&A11)-COUNTIF('Synthèse - classe'!$D$7:$D$41,\">=\"&B11)","v":0},null,0.3,0.4,"De 30% à 40%",{"$f":"COUNTIF('Synthèse - classe'!$F$7:$F$41,\">=\"&F11)-COUNTIF('Synthèse - classe'!$F$7:$F$41,\">=\"&G11)","v":0}]
[0.4,0.5,"De 40% à 50%",{"$f":"COUNTIF('Synthèse - classe'!$D$7:$D$41,\">=\"&A12)-COUNTIF('Synthèse - classe'!$D$7:$D$41,\">=\"&B12)","v":0},null,0.4,0.5,"De 40% à 50%",{"$f":"COUNTIF('Synthèse - classe'!$F$7:$F$41,\">=\"&F12)-COUNTIF('Synthèse - classe'!$F$7:$F$41,\">=\"&G12)","v":0}]
[0.5,0.6,"De 50% à 60%",{"$f":"COUNTIF('Synthèse - classe'!$D$7:$D$41,\">=\"&A13)-COUNTIF('Synthèse - classe'!$D$7:$D$41,\">=\"&B13)","v":0},null,0.5,0.6,"De 50% à 60%",{"$f":"COUNTIF('Synthèse - classe'!$F$7:$F$41,\">=\"&F13)-COUNTIF('Synthèse - classe'!$F$7:$F$41,\">=\"&G13)","v":0}]
[0.6,0.7,"De 60% à 70%",{"$f":"COUNTIF('Synthèse - classe'!$D$7:$D$41,\">=\"&A14)-COUNTIF('Synthèse - classe'!$D$7:$D$41,\">=\"&B14)","v":0},null,0.6,0.7,"De 60% à 70%",{"$f":"COUNTIF('Synthèse - classe'!$F$7:$F$41,\">=\"&F14)-COUNTIF('Synthèse - classe'!$F$7:$F$41,\">=\"&G14)","v":0}]
[0.7,0.8,"De 70% à 80%",{"$f":"COUNTIF('Synthèse - classe'!$D$7:$D$41,\">=\"&A15)-COUNTIF('Synthèse - classe'!$D$7:$D$41,\">=\"&B15)","v":0},null,0.7,0.8,"De 70% à 80%",{"$f":"COUNTIF('Synthèse - classe'!$F$7:$F$41,\">=\"&F15)-COUNTIF('Synthèse - classe'!$F$7:$F$41,\">=\"&G15)","v":0}]
[0.8,0.9,"De 80% à 90%",{"$f":"COUNTIF('Synthèse - classe'!$D$7:$D$41,\">=\"&A16)-COUNTIF('Synthèse - classe'!$D$7:$D$41,\">=\"&B16)","v":0},null,0.8,0.9,"De 80% à 90%",{"$f":"COUNTIF('Synthèse - classe'!$F$7:$F$41,\">=\"&F16)-COUNTIF('Synthèse - classe'!$F$7:$F$41,\">=\"&G16)","v":0}]
[0.9,1,"De 90% à 100%",{"$f":"COUNTIF('Synthèse - classe'!$D$7:$D$41,\">=\"&A17)","v":0},null,0.9,1,"De 90% à 100%",{"$f":"COUNTIF('Synthèse - classe'!$F$7:$F$41,\">=\"&F17)","v":0}]

{"sheet":"Groupes de besoin","index":14,"n_rows":203,"n_cols":10,"rows_kept":203,"cut":false,"hidden":false,"merged":[[167,0,167,3],[82,0,82,3],[0,0,0,3],[1,0,1,3],[2,0,2,3],[42,0,42,3],[124,0,124,3],[83,0,83,3],[43,0,43,3],[3,0,3,3]]}
["GROUPES DE BESOIN"]
[{"$f":"\"Classe de \" & Informations!B7","v":"Classe de "}]
[]
["LECTURE - DÉCODAGE ET LECTURE À VOIX HAUTE"]
[]
[null,"ü","Groupe de besoin","¡",null,null,"Numéro 1","Numéro 2"]
[1,{"$f":"IF(C7=\"\",\"\",\"o\")","v":""},{"$f":"IF(D7=\"\",\"\",IF(ISERR(VLOOKUP(D7,E$7:F$41,2,0)),\"\",VLOOKUP(D7,E$7:F$41,2,0)))","v":""},{"$f":"IF(ROW(D7)-6>COUNT(E$7:E$41),\"\",SMALL(E$7:E$41,ROW(D7)-6))","v":""},{"$f":"IF(Saisie!YB$14<$D$165,Saisie!YB$14,\"\")","v":""},{"$f":"Élèves!D$2","v":" "},1,{"$f":"IF(ISERROR(VLOOKUP(C7,F$7:G$41,2,0)),\"\",VLOOKUP(C7,F$7:G$41,2,0))","v":""}]
[{"$f":"IF(ISTEXT(C8),A7+1,\"\")","v":2},"",{"$f":"IF(D8=\"\",\"\",IF(D8=D7,VLOOKUP(D8,OFFSET(E$7,H7,0,1,1):F$41,2,0),VLOOKUP(D8,E$7:F$41,2,0)))","v":""},"",{"$f":"IF(Saisie!YC$14<$D$165,Saisie!YC$14,\"\")","v":""},{"$f":"Élèves!D$3","v":" "},2,""]
[3,"",{"$f":"IF(D9=\"\",\"\",IF(D9=D8,VLOOKUP(D9,OFFSET(E$7,H8,0,1,1):F$41,2,0),VLOOKUP(D9,E$7:F$41,2,0)))","v":""},"",{"$f":"IF(Saisie!YD$14<$D$165,Saisie!YD$14,\"\")","v":""},{"$f":"Élèves!D$4","v":" "},3,""]
[4,"",{"$f":"IF(D10=\"\",\"\",IF(D10=D9,VLOOKUP(D10,OFFSET(E$7,H9,0,1,1):F$41,2,0),VLOOKUP(D10,E$7:F$41,2,0)))","v":""},"",{"$f":"IF(Saisie!YE$14<$D$165,Saisie!YE$14,\"\")","v":""},{"$f":"Élèves!D$5","v":" "},4,""]
[5,"",{"$f":"IF(D11=\"\",\"\",IF(D11=D10,VLOOKUP(D11,OFFSET(E$7,H10,0,1,1):F$41,2,0),VLOOKUP(D11,E$7:F$41,2,0)))","v":""},"",{"$f":"IF(Saisie!YF$14<$D$165,Saisie!YF$14,\"\")","v":""},{"$f":"Élèves!D$6","v":" "},5,""]
[6,"",{"$f":"IF(D12=\"\",\"\",IF(D12=D11,VLOOKUP(D12,OFFSET(E$7,H11,0,1,1):F$41,2,0),VLOOKUP(D12,E$7:F$41,2,0)))","v":""},"",{"$f":"IF(Saisie!YG$14<$D$165,Saisie!YG$14,\"\")","v":""},{"$f":"Élèves!D$7","v":" "},6,""]
[7,"",{"$f":"IF(D13=\"\",\"\",IF(D13=D12,VLOOKUP(D13,OFFSET(E$7,H12,0,1,1):F$41,2,0),VLOOKUP(D13,E$7:F$41,2,0)))","v":""},"",{"$f":"IF(Saisie!YH$14<$D$165,Saisie!YH$14,\"\")","v":""},{"$f":"Élèves!D$8","v":" "},7,""]
[8,"",{"$f":"IF(D14=\"\",\"\",IF(D14=D13,VLOOKUP(D14,OFFSET(E$7,H13,0,1,1):F$41,2,0),VLOOKUP(D14,E$7:F$41,2,0)))","v":""},"",{"$f":"IF(Saisie!YI$14<$D$165,Saisie!YI$14,\"\")","v":""},{"$f":"Élèves!D$9","v":" "},8,""]
[9,"",{"$f":"IF(D15=\"\",\"\",IF(D15=D14,VLOOKUP(D15,OFFSET(E$7,H14,0,1,1):F$41,2,0),VLOOKUP(D15,E$7:F$41,2,0)))","v":""},"",{"$f":"IF(Saisie!YJ$14<$D$165,Saisie!YJ$14,\"\")","v":""},{"$f":"Élèves!D$10","v":" "},9,""]
[10,"",{"$f":"IF(D16=\"\",\"\",IF(D16=D15,VLOOKUP(D16,OFFSET(E$7,H15,0,1,1):F$41,2,0),VLOOKUP(D16,E$7:F$41,2,0)))","v":""},"",{"$f":"IF(Saisie!YK$14<$D$165,Saisie!YK$14,\"\")","v":""},{"$f":"Élèves!D$11","v":" "},10,""]
[11,null,{"$f":"IF(D17=\"\",\"\",IF(D17=D16,VLOOKUP(D17,OFFSET(E$7,H16,0,1,1):F$41,2,0),VLOOKUP(D17,E$7:F$41,2,0)))","v":""},"",{"$f":"IF(Saisie!YL$14<$D$165,Saisie!YL$14,\"\")","v":""},{"$f":"Élèves!D$12","v":" "},11,""]
[12,null,{"$f":"IF(D18=\"\",\"\",IF(D18=D17,VLOOKUP(D18,OFFSET(E$7,H17,0,1,1):F$41,2,0),VLOOKUP(D18,E$7:F$41,2,0)))","v":""},"",{"$f":"IF(Saisie!YM$14<$D$165,Saisie!YM$14,\"\")","v":""},{"$f":"Élèves!D$13","v":" "},12,""]
[13,null,{"$f":"IF(D19=\"\",\"\",IF(D19=D18,VLOOKUP(D19,OFFSET(E$7,H18,0,1,1):F$41,2,0),VLOOKUP(D19,E$7:F$41,2,0)))","v":""},"",{"$f":"IF(Saisie!YN$14<$D$165,Saisie!YN$14,\"\")","v":""},{"$f":"Élèves!D$14","v":" "},13,""]
[14,null,{"$f":"IF(D20=\"\",\"\",IF(D20=D19,VLOOKUP(D20,OFFSET(E$7,H19,0,1,1):F$41,2,0),VLOOKUP(D20,E$7:F$41,2,0)))","v":""},"",{"$f":"IF(Saisie!YO$14<$D$165,Saisie!YO$14,\"\")","v":""},{"$f":"Élèves!D$15","v":" "},14,""]
[15,null,{"$f":"IF(D21=\"\",\"\",IF(D21=D20,VLOOKUP(D21,OFFSET(E$7,H20,0,1,1):F$41,2,0),VLOOKUP(D21,E$7:F$41,2,0)))","v":""},"",{"$f":"IF(Saisie!YP$14<$D$165,Saisie!YP$14,\"\")","v":""},{"$f":"Élèves!D$16","v":" "},15,""]
[16,null,{"$f":"IF(D22=\"\",\"\",IF(D22=D21,VLOOKUP(D22,OFFSET(E$7,H21,0,1,1):F$41,2,0),VLOOKUP(D22,E$7:F$41,2,0)))","v":""},"",{"$f":"IF(Saisie!YQ$14<$D$165,Saisie!YQ$14,\"\")","v":""},{"$f":"Élèves!D$17","v":" "},16,""]
[17,null,{"$f":"IF(D23=\"\",\"\",IF(D23=D22,VLOOKUP(D23,OFFSET(E$7,H22,0,1,1):F$41,2,0),VLOOKUP(D23,E$7:F$41,2,0)))","v":""},"",{"$f":"IF(Saisie!YR$14<$D$165,Saisie!YR$14,\"\")","v":""},{"$f":"Élèves!D$18","v":" "},17,""]
[18,null,{"$f":"IF(D24=\"\",\"\",IF(D24=D23,VLOOKUP(D24,OFFSET(E$7,H23,0,1,1):F$41,2,0),VLOOKUP(D24,E$7:F$41,2,0)))","v":""},"",{"$f":"IF(Saisie!YS$14<$D$165,Saisie!YS$14,\"\")","v":""},{"$f":"Élèves!D$19","v":" "},18,""]
[19,null,{"$f":"IF(D25=\"\",\"\",IF(D25=D24,VLOOKUP(D25,OFFSET(E$7,H24,0,1,1):F$41,2,0),VLOOKUP(D25,E$7:F$41,2,0)))","v":""},"",{"$f":"IF(Saisie!YT$14<$D$165,Saisie!YT$14,\"\")","v":""},{"$f":"Élèves!D$20","v":" "},19,""]
[20,null,{"$f":"IF(D26=\"\",\"\",IF(D26=D25,VLOOKUP(D26,OFFSET(E$7,H25,0,1,1):F$41,2,0),VLOOKUP(D26,E$7:F$41,2,0)))","v":""},"",{"$f":"IF(Saisie!YU$14<$D$165,Saisie!YU$14,\"\")","v":""},{"$f":"Élèves!D$21","v":" "},20,""]
[21,null,{"$f":"IF(D27=\"\",\"\",IF(D27=D26,VLOOKUP(D27,OFFSET(E$7,H26,0,1,1):F$41,2,0),VLOOKUP(D27,E$7:F$41,2,0)))","v":""},"",{"$f":"IF(Saisie!YV$14<$D$165,Saisie!YV$14,\"\")","v":""},{"$f":"Élèves!D$22","v":" "},21,""]
[22,null,{"$f":"IF(D28=\"\",\"\",IF(D28=D27,VLOOKUP(D28,OFFSET(E$7,H27,0,1,1):F$41,2,0),VLOOKUP(D28,E$7:F$41,2,0)))","v":""},"",{"$f":"IF(Saisie!YW$14<$D$165,Saisie!YW$14,\"\")","v":""},{"$f":"Élèves!D$23","v":" "},22,""]
[23,null,{"$f":"IF(D29=\"\",\"\",IF(D29=D28,VLOOKUP(D29,OFFSET(E$7,H28,0,1,1):F$41,2,0),VLOOKUP(D29,E$7:F$41,2,0)))","v":""},"",{"$f":"IF(Saisie!YX$14<$D$165,Saisie!YX$14,\"\")","v":""},{"$f":"Élèves!D$24","v":" "},23,""]
[24,null,{"$f":"IF(D30=\"\",\"\",IF(D30=D29,VLOOKUP(D30,OFFSET(E$7,H29,0,1,1):F$41,2,0),VLOOKUP(D30,E$7:F$41,2,0)))","v":""},"",{"$f":"IF(Saisie!YY$14<$D$165,Saisie!YY$14,\"\")","v":""},{"$f":"Élèves!D$25","v":" "},24,""]
[25,null,{"$f":"IF(D31=\"\",\"\",IF(D31=D30,VLOOKUP(D31,OFFSET(E$7,H30,0,1,1):F$41,2,0),VLOOKUP(D31,E$7:F$41,2,0)))","v":""},"",{"$f":"IF(Saisie!YZ$14<$D$165,Saisie!YZ$14,\"\")","v":""},{"$f":"Élèves!D$26","v":" "},25,""]
[26,null,{"$f":"IF(D32=\"\",\"\",IF(D32=D31,VLOOKUP(D32,OFFSET(E$7,H31,0,1,1):F$41,2,0),VLOOKUP(D32,E$7:F$41,2,0)))","v":""},"",{"$f":"IF(Saisie!ZA$14<$D$165,Saisie!ZA$14,\"\")","v":""},{"$f":"Élèves!D$27","v":" "},26,""]
[27,null,{"$f":"IF(D33=\"\",\"\",IF(D33=D32,VLOOKUP(D33,OFFSET(E$7,H32,0,1,1):F$41,2,0),VLOOKUP(D33,E$7:F$41,2,0)))","v":""},"",{"$f":"IF(Saisie!ZB$14<$D$165,Saisie!ZB$14,\"\")","v":""},{"$f":"Élèves!D$28","v":" "},27,""]
[28,null,{"$f":"IF(D34=\"\",\"\",IF(D34=D33,VLOOKUP(D34,OFFSET(E$7,H33,0,1,1):F$41,2,0),VLOOKUP(D34,E$7:F$41,2,0)))","v":""},"",{"$f":"IF(Saisie!ZC$14<$D$165,Saisie!ZC$14,\"\")","v":""},{"$f":"Élèves!D$29","v":" "},28,""]
[29,null,{"$f":"IF(D35=\"\",\"\",IF(D35=D34,VLOOKUP(D35,OFFSET(E$7,H34,0,1,1):F$41,2,0),VLOOKUP(D35,E$7:F$41,2,0)))","v":""},"",{"$f":"IF(Saisie!ZD$14<$D$165,Saisie!ZD$14,\"\")","v":""},{"$f":"Élèves!D$30","v":" "},29,""]
[30,null,{"$f":"IF(D36=\"\",\"\",IF(D36=D35,VLOOKUP(D36,OFFSET(E$7,H35,0,1,1):F$41,2,0),VLOOKUP(D36,E$7:F$41,2,0)))","v":""},"",{"$f":"IF(Saisie!ZE$14<$D$165,Saisie!ZE$14,\"\")","v":""},{"$f":"Élèves!D$31","v":" "},30,""]
[31,null,{"$f":"IF(D37=\"\",\"\",IF(D37=D36,VLOOKUP(D37,OFFSET(E$7,H36,0,1,1):F$41,2,0),VLOOKUP(D37,E$7:F$41,2,0)))","v":""},"",{"$f":"IF(Saisie!ZF$14<$D$165,Saisie!ZF$14,\"\")","v":""},{"$f":"Élèves!D$32","v":" "},31,""]
[32,null,{"$f":"IF(D38=\"\",\"\",IF(D38=D37,VLOOKUP(D38,OFFSET(E$7,H37,0,1,1):F$41,2,0),VLOOKUP(D38,E$7:F$41,2,0)))","v":""},"",{"$f":"IF(Saisie!ZG$14<$D$165,Saisie!ZG$14,\"\")","v":""},{"$f":"Élèves!D$33","v":" "},32,""]
[33,null,{"$f":"IF(D39=\"\",\"\",IF(D39=D38,VLOOKUP(D39,OFFSET(E$7,H38,0,1,1):F$41,2,0),VLOOKUP(D39,E$7:F$41,2,0)))","v":""},"",{"$f":"IF(Saisie!ZH$14<$D$165,Saisie!ZH$14,\"\")","v":""},{"$f":"Élèves!D$34","v":" "},33,""]
[34,null,{"$f":"IF(D40=\"\",\"\",IF(D40=D39,VLOOKUP(D40,OFFSET(E$7,H39,0,1,1):F$41,2,0),VLOOKUP(D40,E$7:F$41,2,0)))","v":""},"",{"$f":"IF(Saisie!ZI$14<$D$165,Saisie!ZI$14,\"\")","v":""},{"$f":"Élèves!D$35","v":" "},34,""]
[{"$f":"IF(ISTEXT(C41),A40+1,\"\")","v":35},null,{"$f":"IF(D41=\"\",\"\",IF(D41=D40,VLOOKUP(D41,OFFSET(E$7,H40,0,1,1):F$41,2,0),VLOOKUP(D41,E$7:F$41,2,0)))","v":""},"",{"$f":"IF(Saisie!ZJ$14<$D$165,Saisie!ZJ$14,\"\")","v":""},{"$f":"Élèves!D$36","v":" "},35,""]
[null,null,{"$f":"IF(C17=\"\",\"\",\"Il serait souhaitable de revoir la lecture - déchiffrage et fluence avec la classe entière.\")","v":""}]
[]
["LECTURE - COMPRÉHENSION"]
[]
[null,"ü","Groupe de besoin","¡",null,null,"Numéro 1","Numéro 2"]
[1,{"$f":"IF(C47=\"\",\"\",\"o\")","v":""},{"$f":"IF(D47=\"\",\"\",IF(ISERR(VLOOKUP(D47,E$47:F$81,2,0)),\"\",VLOOKUP(D47,E$47:F$81,2,0)))","v":""},{"$f":"IF(ROW(D47)-46>COUNT(E$47:E$81),\"\",SMALL(E$47:E$81,ROW(D47)-46))","v":""},{"$f":"IF(Saisie!YB$15<$D$165,Saisie!YB$15,\"\")","v":""},{"$f":"Élèves!D$2","v":" "},1,{"$f":"IF(ISERROR(VLOOKUP(C47,F$7:G$41,2,0)),\"\",VLOOKUP(C47,F$7:G$41,2,0))","v":""}]
[{"$f":"IF(ISTEXT(C48),A47+1,\"\")","v":2},"",{"$f":"IF(D48=\"\",\"\",IF(D48=D47,VLOOKUP(D48,OFFSET(E$47,H47,0,1,1):F$81,2,0),VLOOKUP(D48,E$47:F$81,2,0)))","v":""},"",{"$f":"IF(Saisie!YC$15<$D$165,Saisie!YC$15,\"\")","v":""},{"$f":"Élèves!D$3","v":" "},2,""]
[3,"",{"$f":"IF(D49=\"\",\"\",IF(D49=D48,VLOOKUP(D49,OFFSET(E$47,H48,0,1,1):F$81,2,0),VLOOKUP(D49,E$47:F$81,2,0)))","v":""},"",{"$f":"IF(Saisie!YD$15<$D$165,Saisie!YD$15,\"\")","v":""},{"$f":"Élèves!D$4","v":" "},3,""]
[4,"",{"$f":"IF(D50=\"\",\"\",IF(D50=D49,VLOOKUP(D50,OFFSET(E$47,H49,0,1,1):F$81,2,0),VLOOKUP(D50,E$47:F$81,2,0)))","v":""},"",{"$f":"IF(Saisie!YE$15<$D$165,Saisie!YE$15,\"\")","v":""},{"$f":"Élèves!D$5","v":" "},4,""]
[5,"",{"$f":"IF(D51=\"\",\"\",IF(D51=D50,VLOOKUP(D51,OFFSET(E$47,H50,0,1,1):F$81,2,0),VLOOKUP(D51,E$47:F$81,2,0)))","v":""},"",{"$f":"IF(Saisie!YF$15<$D$165,Saisie!YF$15,\"\")","v":""},{"$f":"Élèves!D$6","v":" "},5,""]
[6,"",{"$f":"IF(D52=\"\",\"\",IF(D52=D51,VLOOKUP(D52,OFFSET(E$47,H51,0,1,1):F$81,2,0),VLOOKUP(D52,E$47:F$81,2,0)))","v":""},"",{"$f":"IF(Saisie!YG$15<$D$165,Saisie!YG$15,\"\")","v":""},{"$f":"Élèves!D$7","v":" "},6,""]
[7,"",{"$f":"IF(D53=\"\",\"\",IF(D53=D52,VLOOKUP(D53,OFFSET(E$47,H52,0,1,1):F$81,2,0),VLOOKUP(D53,E$47:F$81,2,0)))","v":""},"",{"$f":"IF(Saisie!YH$15<$D$165,Saisie!YH$15,\"\")","v":""},{"$f":"Élèves!D$8","v":" "},7,""]
[8,"",{"$f":"IF(D54=\"\",\"\",IF(D54=D53,VLOOKUP(D54,OFFSET(E$47,H53,0,1,1):F$81,2,0),VLOOKUP(D54,E$47:F$81,2,0)))","v":""},"",{"$f":"IF(Saisie!YI$15<$D$165,Saisie!YI$15,\"\")","v":""},{"$f":"Élèves!D$9","v":" "},8,""]
[9,"",{"$f":"IF(D55=\"\",\"\",IF(D55=D54,VLOOKUP(D55,OFFSET(E$47,H54,0,1,1):F$81,2,0),VLOOKUP(D55,E$47:F$81,2,0)))","v":""},"",{"$f":"IF(Saisie!YJ$15<$D$165,Saisie!YJ$15,\"\")","v":""},{"$f":"Élèves!D$10","v":" "},9,""]
[10,"",{"$f":"IF(D56=\"\",\"\",IF(D56=D55,VLOOKUP(D56,OFFSET(E$47,H55,0,1,1):F$81,2,0),VLOOKUP(D56,E$47:F$81,2,0)))","v":""},"",{"$f":"IF(Saisie!YK$15<$D$165,Saisie!YK$15,\"\")","v":""},{"$f":"Élèves!D$11","v":" "},10,""]
[11,null,{"$f":"IF(D57=\"\",\"\",IF(D57=D56,VLOOKUP(D57,OFFSET(E$47,H56,0,1,1):F$81,2,0),VLOOKUP(D57,E$47:F$81,2,0)))","v":""},"",{"$f":"IF(Saisie!YL$15<$D$165,Saisie!YL$15,\"\")","v":""},{"$f":"Élèves!D$12","v":" "},11,""]
[12,null,{"$f":"IF(D58=\"\",\"\",IF(D58=D57,VLOOKUP(D58,OFFSET(E$47,H57,0,1,1):F$81,2,0),VLOOKUP(D58,E$47:F$81,2,0)))","v":""},"",{"$f":"IF(Saisie!YM$15<$D$165,Saisie!YM$15,\"\")","v":""},{"$f":"Élèves!D$13","v":" "},12,""]
[13,null,{"$f":"IF(D59=\"\",\"\",IF(D59=D58,VLOOKUP(D59,OFFSET(E$47,H58,0,1,1):F$81,2,0),VLOOKUP(D59,E$47:F$81,2,0)))","v":""},"",{"$f":"IF(Saisie!YN$15<$D$165,Saisie!YN$15,\"\")","v":""},{"$f":"Élèves!D$14","v":" "},13,""]
[14,null,{"$f":"IF(D60=\"\",\"\",IF(D60=D59,VLOOKUP(D60,OFFSET(E$47,H59,0,1,1):F$81,2,0),VLOOKUP(D60,E$47:F$81,2,0)))","v":""},"",{"$f":"IF(Saisie!YO$15<$D$165,Saisie!YO$15,\"\")","v":""},{"$f":"Élèves!D$15","v":" "},14,""]
[15,null,{"$f":"IF(D61=\"\",\"\",IF(D61=D60,VLOOKUP(D61,OFFSET(E$47,H60,0,1,1):F$81,2,0),VLOOKUP(D61,E$47:F$81,2,0)))","v":""},"",{"$f":"IF(Saisie!YP$15<$D$165,Saisie!YP$15,\"\")","v":""},{"$f":"Élèves!D$16","v":" "},15,""]
[16,null,{"$f":"IF(D62=\"\",\"\",IF(D62=D61,VLOOKUP(D62,OFFSET(E$47,H61,0,1,1):F$81,2,0),VLOOKUP(D62,E$47:F$81,2,0)))","v":""},"",{"$f":"IF(Saisie!YQ$15<$D$165,Saisie!YQ$15,\"\")","v":""},{"$f":"Élèves!D$17","v":" "},16,""]
[17,null,{"$f":"IF(D63=\"\",\"\",IF(D63=D62,VLOOKUP(D63,OFFSET(E$47,H62,0,1,1):F$81,2,0),VLOOKUP(D63,E$47:F$81,2,0)))","v":""},"",{"$f":"IF(Saisie!YR$15<$D$165,Saisie!YR$15,\"\")","v":""},{"$f":"Élèves!D$18","v":" "},17,""]
[18,null,{"$f":"IF(D64=\"\",\"\",IF(D64=D63,VLOOKUP(D64,OFFSET(E$47,H63,0,1,1):F$81,2,0),VLOOKUP(D64,E$47:F$81,2,0)))","v":""},"",{"$f":"IF(Saisie!YS$15<$D$165,Saisie!YS$15,\"\")","v":""},{"$f":"Élèves!D$19","v":" "},18,""]
[19,null,{"$f":"IF(D65=\"\",\"\",IF(D65=D64,VLOOKUP(D65,OFFSET(E$47,H64,0,1,1):F$81,2,0),VLOOKUP(D65,E$47:F$81,2,0)))","v":""},"",{"$f":"IF(Saisie!YT$15<$D$165,Saisie!YT$15,\"\")","v":""},{"$f":"Élèves!D$20","v":" "},19,""]
[20,null,{"$f":"IF(D66=\"\",\"\",IF(D66=D65,VLOOKUP(D66,OFFSET(E$47,H65,0,1,1):F$81,2,0),VLOOKUP(D66,E$47:F$81,2,0)))","v":""},"",{"$f":"IF(Saisie!YU$15<$D$165,Saisie!YU$15,\"\")","v":""},{"$f":"Élèves!D$21","v":" "},20,""]
[21,null,{"$f":"IF(D67=\"\",\"\",IF(D67=D66,VLOOKUP(D67,OFFSET(E$47,H66,0,1,1):F$81,2,0),VLOOKUP(D67,E$47:F$81,2,0)))","v":""},"",{"$f":"IF(Saisie!YV$15<$D$165,Saisie!YV$15,\"\")","v":""},{"$f":"Élèves!D$22","v":" "},21,""]
[22,null,{"$f":"IF(D68=\"\",\"\",IF(D68=D67,VLOOKUP(D68,OFFSET(E$47,H67,0,1,1):F$81,2,0),VLOOKUP(D68,E$47:F$81,2,0)))","v":""},"",{"$f":"IF(Saisie!YW$15<$D$165,Saisie!YW$15,\"\")","v":""},{"$f":"Élèves!D$23","v":" "},22,""]
[23,null,{"$f":"IF(D69=\"\",\"\",IF(D69=D68,VLOOKUP(D69,OFFSET(E$47,H68,0,1,1):F$81,2,0),VLOOKUP(D69,E$47:F$81,2,0)))","v":""},"",{"$f":"IF(Saisie!YX$15<$D$165,Saisie!YX$15,\"\")","v":""},{"$f":"Élèves!D$24","v":" "},23,""]
[24,null,{"$f":"IF(D70=\"\",\"\",IF(D70=D69,VLOOKUP(D70,OFFSET(E$47,H69,0,1,1):F$81,2,0),VLOOKUP(D70,E$47:F$81,2,0)))","v":""},"",{"$f":"IF(Saisie!YY$15<$D$165,Saisie!YY$15,\"\")","v":""},{"$f":"Élèves!D$25","v":" "},24,""]
[25,null,{"$f":"IF(D71=\"\",\"\",IF(D71=D70,VLOOKUP(D71,OFFSET(E$47,H70,0,1,1):F$81,2,0),VLOOKUP(D71,E$47:F$81,2,0)))","v":""},"",{"$f":"IF(Saisie!YZ$15<$D$165,Saisie!YZ$15,\"\")","v":""},{"$f":"Élèves!D$26","v":" "},25,""]
[26,null,{"$f":"IF(D72=\"\",\"\",IF(D72=D71,VLOOKUP(D72,OFFSET(E$47,H71,0,1,1):F$81,2,0),VLOOKUP(D72,E$47:F$81,2,0)))","v":""},"",{"$f":"IF(Saisie!ZA$15<$D$165,Saisie!ZA$15,\"\")","v":""},{"$f":"Élèves!D$27","v":" "},26,""]
[27,null,{"$f":"IF(D73=\"\",\"\",IF(D73=D72,VLOOKUP(D73,OFFSET(E$47,H72,0,1,1):F$81,2,0),VLOOKUP(D73,E$47:F$81,2,0)))","v":""},"",{"$f":"IF(Saisie!ZB$15<$D$165,Saisie!ZB$15,\"\")","v":""},{"$f":"Élèves!D$28","v":" "},27,""]
[28,null,{"$f":"IF(D74=\"\",\"\",IF(D74=D73,VLOOKUP(D74,OFFSET(E$47,H73,0,1,1):F$81,2,0),VLOOKUP(D74,E$47:F$81,2,0)))","v":""},"",{"$f":"IF(Saisie!ZC$15<$D$165,Saisie!ZC$15,\"\")","v":""},{"$f":"Élèves!D$29","v":" "},28,""]
[29,null,{"$f":"IF(D75=\"\",\"\",IF(D75=D74,VLOOKUP(D75,OFFSET(E$47,H74,0,1,1):F$81,2,0),VLOOKUP(D75,E$47:F$81,2,0)))","v":""},"",{"$f":"IF(Saisie!ZD$15<$D$165,Saisie!ZD$15,\"\")","v":""},{"$f":"Élèves!D$30","v":" "},29,""]
[30,null,{"$f":"IF(D76=\"\",\"\",IF(D76=D75,VLOOKUP(D76,OFFSET(E$47,H75,0,1,1):F$81,2,0),VLOOKUP(D76,E$47:F$81,2,0)))","v":""},"",{"$f":"IF(Saisie!ZE$15<$D$165,Saisie!ZE$15,\"\")","v":""},{"$f":"Élèves!D$31","v":" "},30,""]
[31,null,{"$f":"IF(D77=\"\",\"\",IF(D77=D76,VLOOKUP(D77,OFFSET(E$47,H76,0,1,1):F$81,2,0),VLOOKUP(D77,E$47:F$81,2,0)))","v":""},"",{"$f":"IF(Saisie!ZF$15<$D$165,Saisie!ZF$15,\"\")","v":""},{"$f":"Élèves!D$32","v":" "},31,""]
[32,null,{"$f":"IF(D78=\"\",\"\",IF(D78=D77,VLOOKUP(D78,OFFSET(E$47,H77,0,1,1):F$81,2,0),VLOOKUP(D78,E$47:F$81,2,0)))","v":""},"",{"$f":"IF(Saisie!ZG$15<$D$165,Saisie!ZG$15,\"\")","v":""},{"$f":"Élèves!D$33","v":" "},32,""]
[33,null,{"$f":"IF(D79=\"\",\"\",IF(D79=D78,VLOOKUP(D79,OFFSET(E$47,H78,0,1,1):F$81,2,0),VLOOKUP(D79,E$47:F$81,2,0)))","v":""},"",{"$f":"IF(Saisie!ZH$15<$D$165,Saisie!ZH$15,\"\")","v":""},{"$f":"Élèves!D$34","v":" "},33,""]
[34,null,{"$f":"IF(D80=\"\",\"\",IF(D80=D79,VLOOKUP(D80,OFFSET(E$47,H79,0,1,1):F$81,2,0),VLOOKUP(D80,E$47:F$81,2,0)))","v":""},"",{"$f":"IF(Saisie!ZI$15<$D$165,Saisie!ZI$15,\"\")","v":""},{"$f":"Élèves!D$35","v":" "},34,""]
[{"$f":"IF(ISTEXT(C81),A80+1,\"\")","v":35},null,{"$f":"IF(D81=\"\",\"\",IF(D81=D80,VLOOKUP(D81,OFFSET(E$47,H80,0,1,1):F$81,2,0),VLOOKUP(D81,E$47:F$81,2,0)))","v":""},"",{"$f":"IF(Saisie!ZJ$15<$D$165,Saisie!ZJ$15,\"\")","v":""},{"$f":"Élèves!D$36","v":" "},35,""]
[null,null,{"$f":"IF(C57=\"\",\"\",\"Il serait souhaitable de revoir la lecture - compréhension avec la classe entière.\")","v":""}]
[]
["ADDITION, SOUSTRACTION"]
[]
[null,"ü","Groupe de besoin","¡",null,null,"Numéro 1","Numéro 2"]
[1,{"$f":"IF(C87=\"\",\"\",\"o\")","v":""},{"$f":"IF(D87=\"\",\"\",IF(ISERR(VLOOKUP(D87,E$87:F$121,2,0)),\"\",VLOOKUP(D87,E$87:F$121,2,0)))","v":""},{"$f":"IF(ROW(D87)-86>COUNT(E$87:E$121),\"\",SMALL(E$87:E$121,ROW(D87)-86))","v":""},{"$f":"IF(Saisie!YB$2<$D$165,Saisie!YB$2,\"\")","v":""},{"$f":"Élèves!D$2","v":" "},1,{"$f":"IF(ISERROR(VLOOKUP(C87,F$7:G$41,2,0)),\"\",VLOOKUP(C87,F$7:G$41,2,0))","v":""}]
[{"$f":"IF(ISTEXT(C88),A87+1,\"\")","v":2},"",{"$f":"IF(D88=\"\",\"\",IF(D88=D87,VLOOKUP(D88,OFFSET(E$87,H87,0,1,1):F$121,2,0),VLOOKUP(D88,E$87:F$121,2,0)))","v":""},"",{"$f":"IF(Saisie!YC$2<$D$165,Saisie!YC$2,\"\")","v":""},{"$f":"Élèves!D$3","v":" "},2,""]
[3,"",{"$f":"IF(D89=\"\",\"\",IF(D89=D88,VLOOKUP(D89,OFFSET(E$87,H88,0,1,1):F$121,2,0),VLOOKUP(D89,E$87:F$121,2,0)))","v":""},"",{"$f":"IF(Saisie!YD$2<$D$165,Saisie!YD$2,\"\")","v":""},{"$f":"Élèves!D$4","v":" "},3,""]
[4,"",{"$f":"IF(D90=\"\",\"\",IF(D90=D89,VLOOKUP(D90,OFFSET(E$87,H89,0,1,1):F$121,2,0),VLOOKUP(D90,E$87:F$121,2,0)))","v":""},"",{"$f":"IF(Saisie!YE$2<$D$165,Saisie!YE$2,\"\")","v":""},{"$f":"Élèves!D$5","v":" "},4,""]
[5,"",{"$f":"IF(D91=\"\",\"\",IF(D91=D90,VLOOKUP(D91,OFFSET(E$87,H90,0,1,1):F$121,2,0),VLOOKUP(D91,E$87:F$121,2,0)))","v":""},"",{"$f":"IF(Saisie!YF$2<$D$165,Saisie!YF$2,\"\")","v":""},{"$f":"Élèves!D$6","v":" "},5,""]
[6,"",{"$f":"IF(D92=\"\",\"\",IF(D92=D91,VLOOKUP(D92,OFFSET(E$87,H91,0,1,1):F$121,2,0),VLOOKUP(D92,E$87:F$121,2,0)))","v":""},"",{"$f":"IF(Saisie!YG$2<$D$165,Saisie!YG$2,\"\")","v":""},{"$f":"Élèves!D$7","v":" "},6,""]
[7,"",{"$f":"IF(D93=\"\",\"\",IF(D93=D92,VLOOKUP(D93,OFFSET(E$87,H92,0,1,1):F$121,2,0),VLOOKUP(D93,E$87:F$121,2,0)))","v":""},"",{"$f":"IF(Saisie!YH$2<$D$165,Saisie!YH$2,\"\")","v":""},{"$f":"Élèves!D$8","v":" "},7,""]
[8,"",{"$f":"IF(D94=\"\",\"\",IF(D94=D93,VLOOKUP(D94,OFFSET(E$87,H93,0,1,1):F$121,2,0),VLOOKUP(D94,E$87:F$121,2,0)))","v":""},"",{"$f":"IF(Saisie!YI$2<$D$165,Saisie!YI$2,\"\")","v":""},{"$f":"Élèves!D$9","v":" "},8,""]
[9,"",{"$f":"IF(D95=\"\",\"\",IF(D95=D94,VLOOKUP(D95,OFFSET(E$87,H94,0,1,1):F$121,2,0),VLOOKUP(D95,E$87:F$121,2,0)))","v":""},"",{"$f":"IF(Saisie!YJ$2<$D$165,Saisie!YJ$2,\"\")","v":""},{"$f":"Élèves!D$10","v":" "},9,""]
[10,"",{"$f":"IF(D96=\"\",\"\",IF(D96=D95,VLOOKUP(D96,OFFSET(E$87,H95,0,1,1):F$121,2,0),VLOOKUP(D96,E$87:F$121,2,0)))","v":""},"",{"$f":"IF(Saisie!YK$2<$D$165,Saisie!YK$2,\"\")","v":""},{"$f":"Élèves!D$11","v":" "},10,""]
[11,null,{"$f":"IF(D97=\"\",\"\",IF(D97=D96,VLOOKUP(D97,OFFSET(E$87,H96,0,1,1):F$121,2,0),VLOOKUP(D97,E$87:F$121,2,0)))","v":""},"",{"$f":"IF(Saisie!YL$2<$D$165,Saisie!YL$2,\"\")","v":""},{"$f":"Élèves!D$12","v":" "},11,""]
[12,null,{"$f":"IF(D98=\"\",\"\",IF(D98=D97,VLOOKUP(D98,OFFSET(E$87,H97,0,1,1):F$121,2,0),VLOOKUP(D98,E$87:F$121,2,0)))","v":""},"",{"$f":"IF(Saisie!YM$2<$D$165,Saisie!YM$2,\"\")","v":""},{"$f":"Élèves!D$13","v":" "},12,""]
[13,null,{"$f":"IF(D99=\"\",\"\",IF(D99=D98,VLOOKUP(D99,OFFSET(E$87,H98,0,1,1):F$121,2,0),VLOOKUP(D99,E$87:F$121,2,0)))","v":""},"",{"$f":"IF(Saisie!YN$2<$D$165,Saisie!YN$2,\"\")","v":""},{"$f":"Élèves!D$14","v":" "},13,""]
[14,null,{"$f":"IF(D100=\"\",\"\",IF(D100=D99,VLOOKUP(D100,OFFSET(E$87,H99,0,1,1):F$121,2,0),VLOOKUP(D100,E$87:F$121,2,0)))","v":""},"",{"$f":"IF(Saisie!YO$2<$D$165,Saisie!YO$2,\"\")","v":""},{"$f":"Élèves!D$15","v":" "},14,""]
[15,null,{"$f":"IF(D101=\"\",\"\",IF(D101=D100,VLOOKUP(D101,OFFSET(E$87,H100,0,1,1):F$121,2,0),VLOOKUP(D101,E$87:F$121,2,0)))","v":""},"",{"$f":"IF(Saisie!YP$2<$D$165,Saisie!YP$2,\"\")","v":""},{"$f":"Élèves!D$16","v":" "},15,""]
[16,null,{"$f":"IF(D102=\"\",\"\",IF(D102=D101,VLOOKUP(D102,OFFSET(E$87,H101,0,1,1):F$121,2,0),VLOOKUP(D102,E$87:F$121,2,0)))","v":""},"",{"$f":"IF(Saisie!YQ$2<$D$165,Saisie!YQ$2,\"\")","v":""},{"$f":"Élèves!D$17","v":" "},16,""]
[17,null,{"$f":"IF(D103=\"\",\"\",IF(D103=D102,VLOOKUP(D103,OFFSET(E$87,H102,0,1,1):F$121,2,0),VLOOKUP(D103,E$87:F$121,2,0)))","v":""},"",{"$f":"IF(Saisie!YR$2<$D$165,Saisie!YR$2,\"\")","v":""},{"$f":"Élèves!D$18","v":" "},17,""]
[18,null,{"$f":"IF(D104=\"\",\"\",IF(D104=D103,VLOOKUP(D104,OFFSET(E$87,H103,0,1,1):F$121,2,0),VLOOKUP(D104,E$87:F$121,2,0)))","v":""},"",{"$f":"IF(Saisie!YS$2<$D$165,Saisie!YS$2,\"\")","v":""},{"$f":"Élèves!D$19","v":" "},18,""]
[19,null,{"$f":"IF(D105=\"\",\"\",IF(D105=D104,VLOOKUP(D105,OFFSET(E$87,H104,0,1,1):F$121,2,0),VLOOKUP(D105,E$87:F$121,2,0)))","v":""},"",{"$f":"IF(Saisie!YT$2<$D$165,Saisie!YT$2,\"\")","v":""},{"$f":"Élèves!D$20","v":" "},19,""]
[20,null,{"$f":"IF(D106=\"\",\"\",IF(D106=D105,VLOOKUP(D106,OFFSET(E$87,H105,0,1,1):F$121,2,0),VLOOKUP(D106,E$87:F$121,2,0)))","v":""},"",{"$f":"IF(Saisie!YU$2<$D$165,Saisie!YU$2,\"\")","v":""},{"$f":"Élèves!D$21","v":" "},20,""]
[21,null,{"$f":"IF(D107=\"\",\"\",IF(D107=D106,VLOOKUP(D107,OFFSET(E$87,H106,0,1,1):F$121,2,0),VLOOKUP(D107,E$87:F$121,2,0)))","v":""},"",{"$f":"IF(Saisie!YV$2<$D$165,Saisie!YV$2,\"\")","v":""},{"$f":"Élèves!D$22","v":" "},21,""]
[22,null,{"$f":"IF(D108=\"\",\"\",IF(D108=D107,VLOOKUP(D108,OFFSET(E$87,H107,0,1,1):F$121,2,0),VLOOKUP(D108,E$87:F$121,2,0)))","v":""},"",{"$f":"IF(Saisie!YW$2<$D$165,Saisie!YW$2,\"\")","v":""},{"$f":"Élèves!D$23","v":" "},22,""]
[23,null,{"$f":"IF(D109=\"\",\"\",IF(D109=D108,VLOOKUP(D109,OFFSET(E$87,H108,0,1,1):F$121,2,0),VLOOKUP(D109,E$87:F$121,2,0)))","v":""},"",{"$f":"IF(Saisie!YX$2<$D$165,Saisie!YX$2,\"\")","v":""},{"$f":"Élèves!D$24","v":" "},23,""]
[24,null,{"$f":"IF(D110=\"\",\"\",IF(D110=D109,VLOOKUP(D110,OFFSET(E$87,H109,0,1,1):F$121,2,0),VLOOKUP(D110,E$87:F$121,2,0)))","v":""},"",{"$f":"IF(Saisie!YY$2<$D$165,Saisie!YY$2,\"\")","v":""},{"$f":"Élèves!D$25","v":" "},24,""]
[25,null,{"$f":"IF(D111=\"\",\"\",IF(D111=D110,VLOOKUP(D111,OFFSET(E$87,H110,0,1,1):F$121,2,0),VLOOKUP(D111,E$87:F$121,2,0)))","v":""},"",{"$f":"IF(Saisie!YZ$2<$D$165,Saisie!YZ$2,\"\")","v":""},{"$f":"Élèves!D$26","v":" "},25,""]
[26,null,{"$f":"IF(D112=\"\",\"\",IF(D112=D111,VLOOKUP(D112,OFFSET(E$87,H111,0,1,1):F$121,2,0),VLOOKUP(D112,E$87:F$121,2,0)))","v":""},"",{"$f":"IF(Saisie!ZA$2<$D$165,Saisie!ZA$2,\"\")","v":""},{"$f":"Élèves!D$27","v":" "},26,""]
[27,null,{"$f":"IF(D113=\"\",\"\",IF(D113=D112,VLOOKUP(D113,OFFSET(E$87,H112,0,1,1):F$121,2,0),VLOOKUP(D113,E$87:F$121,2,0)))","v":""},"",{"$f":"IF(Saisie!ZB$2<$D$165,Saisie!ZB$2,\"\")","v":""},{"$f":"Élèves!D$28","v":" "},27,""]
[28,null,{"$f":"IF(D114=\"\",\"\",IF(D114=D113,VLOOKUP(D114,OFFSET(E$87,H113,0,1,1):F$121,2,0),VLOOKUP(D114,E$87:F$121,2,0)))","v":""},"",{"$f":"IF(Saisie!ZC$2<$D$165,Saisie!ZC$2,\"\")","v":""},{"$f":"Élèves!D$29","v":" "},28,""]
[29,null,{"$f":"IF(D115=\"\",\"\",IF(D115=D114,VLOOKUP(D115,OFFSET(E$87,H114,0,1,1):F$121,2,0),VLOOKUP(D115,E$87:F$121,2,0)))","v":""},"",{"$f":"IF(Saisie!ZD$2<$D$165,Saisie!ZD$2,\"\")","v":""},{"$f":"Élèves!D$30","v":" "},29,""]
[30,null,{"$f":"IF(D116=\"\",\"\",IF(D116=D115,VLOOKUP(D116,OFFSET(E$87,H115,0,1,1):F$121,2,0),VLOOKUP(D116,E$87:F$121,2,0)))","v":""},"",{"$f":"IF(Saisie!ZE$2<$D$165,Saisie!ZE$2,\"\")","v":""},{"$f":"Élèves!D$31","v":" "},30,""]
[31,null,{"$f":"IF(D117=\"\",\"\",IF(D117=D116,VLOOKUP(D117,OFFSET(E$87,H116,0,1,1):F$121,2,0),VLOOKUP(D117,E$87:F$121,2,0)))","v":""},"",{"$f":"IF(Saisie!ZF$2<$D$165,Saisie!ZF$2,\"\")","v":""},{"$f":"Élèves!D$32","v":" "},31,""]
[32,null,{"$f":"IF(D118=\"\",\"\",IF(D118=D117,VLOOKUP(D118,OFFSET(E$87,H117,0,1,1):F$121,2,0),VLOOKUP(D118,E$87:F$121,2,0)))","v":""},"",{"$f":"IF(Saisie!ZG$2<$D$165,Saisie!ZG$2,\"\")","v":""},{"$f":"Élèves!D$33","v":" "},32,""]
[33,null,{"$f":"IF(D119=\"\",\"\",IF(D119=D118,VLOOKUP(D119,OFFSET(E$87,H118,0,1,1):F$121,2,0),VLOOKUP(D119,E$87:F$121,2,0)))","v":""},"",{"$f":"IF(Saisie!ZH$2<$D$165,Saisie!ZH$2,\"\")","v":""},{"$f":"Élèves!D$34","v":" "},33,""]
[34,null,{"$f":"IF(D120=\"\",\"\",IF(D120=D119,VLOOKUP(D120,OFFSET(E$87,H119,0,1,1):F$121,2,0),VLOOKUP(D120,E$87:F$121,2,0)))","v":""},"",{"$f":"IF(Saisie!ZI$2<$D$165,Saisie!ZI$2,\"\")","v":""},{"$f":"Élèves!D$35","v":" "},34,""]
[{"$f":"IF(ISTEXT(C121),A120+1,\"\")","v":35},null,{"$f":"IF(D121=\"\",\"\",IF(D121=D120,VLOOKUP(D121,OFFSET(E$87,H120,0,1,1):F$121,2,0),VLOOKUP(D121,E$87:F$121,2,0)))","v":""},"",{"$f":"IF(Saisie!ZJ$2<$D$165,Saisie!ZJ$2,\"\")","v":""},{"$f":"Élèves!D$36","v":" "},35,""]
[null,null,{"$f":"IF(C97=\"\",\"\",\"Il serait souhaitable de revoir l'addition et la soustraction avec la classe entière.\")","v":""}]
[{"$f":"Informations!$A$14","v":" : "},null,null,{"$f":"Informations!$B$14","v":" : "}]
[{"$f":"Informations!$A$15","v":""},null,null,{"$f":"Informations!$B$15","v":""}]
["PROBLÈMES ADDITIFS ET SOUSTRACTIFS"]
[]
[null,"ü","Groupe de besoin","¡",null,null,"Numéro 1","Numéro 2"]
[1,{"$f":"IF(C128=\"\",\"\",\"o\")","v":""},{"$f":"IF(D128=\"\",\"\",IF(ISERR(VLOOKUP(D128,E$128:F$162,2,0)),\"\",VLOOKUP(D128,E$128:F$162,2,0)))","v":""},{"$f":"IF(ROW(D128)-127>COUNT(E$128:E$162),\"\",SMALL(E$128:E$162,ROW(D128)-127))","v":""},{"$f":"IF(Saisie!YB$6<$D$165,Saisie!YB$6,\"\")","v":""},{"$f":"Élèves!D$2","v":" "},1,{"$f":"IF(ISERROR(VLOOKUP(C128,F$7:G$41,2,0)),\"\",VLOOKUP(C128,F$7:G$41,2,0))","v":""}]
[{"$f":"IF(ISTEXT(C129),A128+1,\"\")","v":2},"",{"$f":"IF(D129=\"\",\"\",IF(D129=D128,VLOOKUP(D129,OFFSET(E$128,H128,0,1,1):F$162,2,0),VLOOKUP(D129,E$128:F$162,2,0)))","v":""},"",{"$f":"IF(Saisie!YC$6<$D$165,Saisie!YC$6,\"\")","v":""},{"$f":"Élèves!D$3","v":" "},2,""]
[3,"",{"$f":"IF(D130=\"\",\"\",IF(D130=D129,VLOOKUP(D130,OFFSET(E$128,H129,0,1,1):F$162,2,0),VLOOKUP(D130,E$128:F$162,2,0)))","v":""},"",{"$f":"IF(Saisie!YD$6<$D$165,Saisie!YD$6,\"\")","v":""},{"$f":"Élèves!D$4","v":" "},3,""]
[4,"",{"$f":"IF(D131=\"\",\"\",IF(D131=D130,VLOOKUP(D131,OFFSET(E$128,H130,0,1,1):F$162,2,0),VLOOKUP(D131,E$128:F$162,2,0)))","v":""},"",{"$f":"IF(Saisie!YE$6<$D$165,Saisie!YE$6,\"\")","v":""},{"$f":"Élèves!D$5","v":" "},4,""]
[5,"",{"$f":"IF(D132=\"\",\"\",IF(D132=D131,VLOOKUP(D132,OFFSET(E$128,H131,0,1,1):F$162,2,0),VLOOKUP(D132,E$128:F$162,2,0)))","v":""},"",{"$f":"IF(Saisie!YF$6<$D$165,Saisie!YF$6,\"\")","v":""},{"$f":"Élèves!D$6","v":" "},5,""]
[6,"",{"$f":"IF(D133=\"\",\"\",IF(D133=D132,VLOOKUP(D133,OFFSET(E$128,H132,0,1,1):F$162,2,0),VLOOKUP(D133,E$128:F$162,2,0)))","v":""},"",{"$f":"IF(Saisie!YG$6<$D$165,Saisie!YG$6,\"\")","v":""},{"$f":"Élèves!D$7","v":" "},6,""]
[7,"",{"$f":"IF(D134=\"\",\"\",IF(D134=D133,VLOOKUP(D134,OFFSET(E$128,H133,0,1,1):F$162,2,0),VLOOKUP(D134,E$128:F$162,2,0)))","v":""},"",{"$f":"IF(Saisie!YH$6<$D$165,Saisie!YH$6,\"\")","v":""},{"$f":"Élèves!D$8","v":" "},7,""]
[8,"",{"$f":"IF(D135=\"\",\"\",IF(D135=D134,VLOOKUP(D135,OFFSET(E$128,H134,0,1,1):F$162,2,0),VLOOKUP(D135,E$128:F$162,2,0)))","v":""},"",{"$f":"IF(Saisie!YI$6<$D$165,Saisie!YI$6,\"\")","v":""},{"$f":"Élèves!D$9","v":" "},8,""]
[9,"",{"$f":"IF(D136=\"\",\"\",IF(D136=D135,VLOOKUP(D136,OFFSET(E$128,H135,0,1,1):F$162,2,0),VLOOKUP(D136,E$128:F$162,2,0)))","v":""},"",{"$f":"IF(Saisie!YJ$6<$D$165,Saisie!YJ$6,\"\")","v":""},{"$f":"Élèves!D$10","v":" "},9,""]
[10,"",{"$f":"IF(D137=\"\",\"\",IF(D137=D136,VLOOKUP(D137,OFFSET(E$128,H136,0,1,1):F$162,2,0),VLOOKUP(D137,E$128:F$162,2,0)))","v":""},"",{"$f":"IF(Saisie!YK$6<$D$165,Saisie!YK$6,\"\")","v":""},{"$f":"Élèves!D$11","v":" "},10,""]
[11,null,{"$f":"IF(D138=\"\",\"\",IF(D138=D137,VLOOKUP(D138,OFFSET(E$128,H137,0,1,1):F$162,2,0),VLOOKUP(D138,E$128:F$162,2,0)))","v":""},"",{"$f":"IF(Saisie!YL$6<$D$165,Saisie!YL$6,\"\")","v":""},{"$f":"Élèves!D$12","v":" "},11,""]
[12,null,{"$f":"IF(D139=\"\",\"\",IF(D139=D138,VLOOKUP(D139,OFFSET(E$128,H138,0,1,1):F$162,2,0),VLOOKUP(D139,E$128:F$162,2,0)))","v":""},"",{"$f":"IF(Saisie!YM$6<$D$165,Saisie!YM$6,\"\")","v":""},{"$f":"Élèves!D$13","v":" "},12,""]
[13,null,{"$f":"IF(D140=\"\",\"\",IF(D140=D139,VLOOKUP(D140,OFFSET(E$128,H139,0,1,1):F$162,2,0),VLOOKUP(D140,E$128:F$162,2,0)))","v":""},"",{"$f":"IF(Saisie!YN$6<$D$165,Saisie!YN$6,\"\")","v":""},{"$f":"Élèves!D$14","v":" "},13,""]
[14,null,{"$f":"IF(D141=\"\",\"\",IF(D141=D140,VLOOKUP(D141,OFFSET(E$128,H140,0,1,1):F$162,2,0),VLOOKUP(D141,E$128:F$162,2,0)))","v":""},"",{"$f":"IF(Saisie!YO$6<$D$165,Saisie!YO$6,\"\")","v":""},{"$f":"Élèves!D$15","v":" "},14,""]
[15,null,{"$f":"IF(D142=\"\",\"\",IF(D142=D141,VLOOKUP(D142,OFFSET(E$128,H141,0,1,1):F$162,2,0),VLOOKUP(D142,E$128:F$162,2,0)))","v":""},"",{"$f":"IF(Saisie!YP$6<$D$165,Saisie!YP$6,\"\")","v":""},{"$f":"Élèves!D$16","v":" "},15,""]
[16,null,{"$f":"IF(D143=\"\",\"\",IF(D143=D142,VLOOKUP(D143,OFFSET(E$128,H142,0,1,1):F$162,2,0),VLOOKUP(D143,E$128:F$162,2,0)))","v":""},"",{"$f":"IF(Saisie!YQ$6<$D$165,Saisie!YQ$6,\"\")","v":""},{"$f":"Élèves!D$17","v":" "},16,""]
[17,null,{"$f":"IF(D144=\"\",\"\",IF(D144=D143,VLOOKUP(D144,OFFSET(E$128,H143,0,1,1):F$162,2,0),VLOOKUP(D144,E$128:F$162,2,0)))","v":""},"",{"$f":"IF(Saisie!YR$6<$D$165,Saisie!YR$6,\"\")","v":""},{"$f":"Élèves!D$18","v":" "},17,""]
[18,null,{"$f":"IF(D145=\"\",\"\",IF(D145=D144,VLOOKUP(D145,OFFSET(E$128,H144,0,1,1):F$162,2,0),VLOOKUP(D145,E$128:F$162,2,0)))","v":""},"",{"$f":"IF(Saisie!YS$6<$D$165,Saisie!YS$6,\"\")","v":""},{"$f":"Élèves!D$19","v":" "},18,""]
[19,null,{"$f":"IF(D146=\"\",\"\",IF(D146=D145,VLOOKUP(D146,OFFSET(E$128,H145,0,1,1):F$162,2,0),VLOOKUP(D146,E$128:F$162,2,0)))","v":""},"",{"$f":"IF(Saisie!YT$6<$D$165,Saisie!YT$6,\"\")","v":""},{"$f":"Élèves!D$20","v":" "},19,""]
[20,null,{"$f":"IF(D147=\"\",\"\",IF(D147=D146,VLOOKUP(D147,OFFSET(E$128,H146,0,1,1):F$162,2,0),VLOOKUP(D147,E$128:F$162,2,0)))","v":""},"",{"$f":"IF(Saisie!YU$6<$D$165,Saisie!YU$6,\"\")","v":""},{"$f":"Élèves!D$21","v":" "},20,""]
[21,null,{"$f":"IF(D148=\"\",\"\",IF(D148=D147,VLOOKUP(D148,OFFSET(E$128,H147,0,1,1):F$162,2,0),VLOOKUP(D148,E$128:F$162,2,0)))","v":""},"",{"$f":"IF(Saisie!YV$6<$D$165,Saisie!YV$6,\"\")","v":""},{"$f":"Élèves!D$22","v":" "},21,""]
[22,null,{"$f":"IF(D149=\"\",\"\",IF(D149=D148,VLOOKUP(D149,OFFSET(E$128,H148,0,1,1):F$162,2,0),VLOOKUP(D149,E$128:F$162,2,0)))","v":""},"",{"$f":"IF(Saisie!YW$6<$D$165,Saisie!YW$6,\"\")","v":""},{"$f":"Élèves!D$23","v":" "},22,""]
[23,null,{"$f":"IF(D150=\"\",\"\",IF(D150=D149,VLOOKUP(D150,OFFSET(E$128,H149,0,1,1):F$162,2,0),VLOOKUP(D150,E$128:F$162,2,0)))","v":""},"",{"$f":"IF(Saisie!YX$6<$D$165,Saisie!YX$6,\"\")","v":""},{"$f":"Élèves!D$24","v":" "},23,""]
[24,null,{"$f":"IF(D151=\"\",\"\",IF(D151=D150,VLOOKUP(D151,OFFSET(E$128,H150,0,1,1):F$162,2,0),VLOOKUP(D151,E$128:F$162,2,0)))","v":""},"",{"$f":"IF(Saisie!YY$6<$D$165,Saisie!YY$6,\"\")","v":""},{"$f":"Élèves!D$25","v":" "},24,""]
[25,null,{"$f":"IF(D152=\"\",\"\",IF(D152=D151,VLOOKUP(D152,OFFSET(E$128,H151,0,1,1):F$162,2,0),VLOOKUP(D152,E$128:F$162,2,0)))","v":""},"",{"$f":"IF(Saisie!YZ$6<$D$165,Saisie!YZ$6,\"\")","v":""},{"$f":"Élèves!D$26","v":" "},25,""]
[26,null,{"$f":"IF(D153=\"\",\"\",IF(D153=D152,VLOOKUP(D153,OFFSET(E$128,H152,0,1,1):F$162,2,0),VLOOKUP(D153,E$128:F$162,2,0)))","v":""},"",{"$f":"IF(Saisie!ZA$6<$D$165,Saisie!ZA$6,\"\")","v":""},{"$f":"Élèves!D$27","v":" "},26,""]
[27,null,{"$f":"IF(D154=\"\",\"\",IF(D154=D153,VLOOKUP(D154,OFFSET(E$128,H153,0,1,1):F$162,2,0),VLOOKUP(D154,E$128:F$162,2,0)))","v":""},"",{"$f":"IF(Saisie!ZB$6<$D$165,Saisie!ZB$6,\"\")","v":""},{"$f":"Élèves!D$28","v":" "},27,""]
[28,null,{"$f":"IF(D155=\"\",\"\",IF(D155=D154,VLOOKUP(D155,OFFSET(E$128,H154,0,1,1):F$162,2,0),VLOOKUP(D155,E$128:F$162,2,0)))","v":""},"",{"$f":"IF(Saisie!ZC$6<$D$165,Saisie!ZC$6,\"\")","v":""},{"$f":"Élèves!D$29","v":" "},28,""]
[29,null,{"$f":"IF(D156=\"\",\"\",IF(D156=D155,VLOOKUP(D156,OFFSET(E$128,H155,0,1,1):F$162,2,0),VLOOKUP(D156,E$128:F$162,2,0)))","v":""},"",{"$f":"IF(Saisie!ZD$6<$D$165,Saisie!ZD$6,\"\")","v":""},{"$f":"Élèves!D$30","v":" "},29,""]
[30,null,{"$f":"IF(D157=\"\",\"\",IF(D157=D156,VLOOKUP(D157,OFFSET(E$128,H156,0,1,1):F$162,2,0),VLOOKUP(D157,E$128:F$162,2,0)))","v":""},"",{"$f":"IF(Saisie!ZE$6<$D$165,Saisie!ZE$6,\"\")","v":""},{"$f":"Élèves!D$31","v":" "},30,""]
[31,null,{"$f":"IF(D158=\"\",\"\",IF(D158=D157,VLOOKUP(D158,OFFSET(E$128,H157,0,1,1):F$162,2,0),VLOOKUP(D158,E$128:F$162,2,0)))","v":""},"",{"$f":"IF(Saisie!ZF$6<$D$165,Saisie!ZF$6,\"\")","v":""},{"$f":"Élèves!D$32","v":" "},31,""]
[32,null,{"$f":"IF(D159=\"\",\"\",IF(D159=D158,VLOOKUP(D159,OFFSET(E$128,H158,0,1,1):F$162,2,0),VLOOKUP(D159,E$128:F$162,2,0)))","v":""},"",{"$f":"IF(Saisie!ZG$6<$D$165,Saisie!ZG$6,\"\")","v":""},{"$f":"Élèves!D$33","v":" "},32,""]
[33,null,{"$f":"IF(D160=\"\",\"\",IF(D160=D159,VLOOKUP(D160,OFFSET(E$128,H159,0,1,1):F$162,2,0),VLOOKUP(D160,E$128:F$162,2,0)))","v":""},"",{"$f":"IF(Saisie!ZH$6<$D$165,Saisie!ZH$6,\"\")","v":""},{"$f":"Élèves!D$34","v":" "},33,""]
[34,null,{"$f":"IF(D161=\"\",\"\",IF(D161=D160,VLOOKUP(D161,OFFSET(E$128,H160,0,1,1):F$162,2,0),VLOOKUP(D161,E$128:F$162,2,0)))","v":""},"",{"$f":"IF(Saisie!ZI$6<$D$165,Saisie!ZI$6,\"\")","v":""},{"$f":"Élèves!D$35","v":" "},34,""]
[{"$f":"IF(ISTEXT(C162),A161+1,\"\")","v":35},null,{"$f":"IF(D162=\"\",\"\",IF(D162=D161,VLOOKUP(D162,OFFSET(E$128,H161,0,1,1):F$162,2,0),VLOOKUP(D162,E$128:F$162,2,0)))","v":""},"",{"$f":"IF(Saisie!ZJ$6<$D$165,Saisie!ZJ$6,\"\")","v":""},{"$f":"Élèves!D$36","v":" "},35,""]
[null,null,{"$f":"IF(C138=\"\",\"\",\"Il serait souhaitable de revoir les problèmes additifs et soustractifs avec la classe entière.\")","v":""}]
[]
[null,null,"Les groupes sont constitués d'élèves qui obtiennent un taux de réussite inférieur à :",0.6,null,null,null,null,null,"Cette valeur est modifiable pour une adaptation au profil de l'école."]
[null,null,null,null,null,null,null,null,null,"Valeurs conseillées : 75%, 67%, 60%, 50%, ou, si besoin, 40%."]
[]
["OBSERVATIONS"]
[]
[]
[]
[]
[]
[]
[]
[]
[]
[]
[]
[]
[]
[]
[]
[]
[]
[]
[]
[]
[]
[]
[]
[]
[]
[]
[]
[]
[]
[]
[]
[]
[]
[{"$f":"Informations!$A$14","v":" : "},null,null,{"$f":"Informations!$B$14","v":" : "}]
[{"$f":"Informations!$A$15","v":""},null,null,{"$f":"Informations!$B$15","v":""}]

{"sheet":"Programmes","index":15,"n_rows":25,"n_cols":5,"rows_kept":25,"cut":false,"hidden":true,"merged":[[1,4,4,4],[5,4,7,4],[21,4,24,4],[18,4,20,4],[8,4,10,4],[14,4,17,4],[11,4,13,4]]}
[null,"Compétences","Item","Niveau","Champ"]
[1,"Conserver une attention soutenue et manifester, si besoin et à bon escient, son incompréhension.",{"$f":"ROW()-1","v":1},null,"Langage oral"]
[{"$f":"IF(ISTEXT(B3),A2+1,\"\")","v":2},"Produire des énoncés clairs en tenant compte de l’objet du propos et des interlocuteurs.",2]
[3,"Pratiquer avec efficacité les formes de discours attendues - notamment raconter, décrire, expliquer.",3]
[4,"Participer avec pertinence à un échange.",4]
[5,"Identifier des mots rapidement.",5,null,"Lecture et compréhension de l'écrit"]
[6,"Lire et comprendre des textes adaptés à la maturité et à la culture scolaire des élèves.",6]
[7,"Lire à voix haute avec fluidité, après préparation, un texte d’une demi-page.",7]
[8,"Copier ou transcrire, dans une écriture lisible, un texte d’une dizaine de lignes.",8,null,"Écriture"]
[9,"Rédiger un texte d’environ une demi-page, cohérent, organisé, ponctué, pertinent.",9]
[{"$f":"IF(ISTEXT(B11),A10+1,\"\")","v":10},"Améliorer une production, notamment l’orthographe, en tenant compte d’indications.",10]
[11,"Orthographier les mots les plus fréquents et les mots invariables mémorisés.",11,null,"Étude de la langue (grammaire, orthographe, lexique)"]
[12,"Raisonner pour réaliser les accords dans le groupe nominal et entre le verbe et son sujet.",12]
[13,"Utiliser ses connaissances sur la langue. ",13]
[14,"Comprendre et utiliser des nombres entiers pour dénombrer, ordonner, repérer, comparer.",14,null,"Nombres et calculs"]
[15,"Nommer, lire, écrire, représenter des nombres entiers.",15]
[16,"Résoudre des problèmes en utilisant des nombres entiers et le calcul.",16]
[17,"Calculer avec des nombres entiers.",17]
[18,"Comparer, estimer, mesurer des longueurs, des masses, des contenances, des durées.",18,null,"Grandeurs et mesures"]
[19,"Utiliser le lexique, les unités, les instruments de mesures spécifiques de ces grandeurs.",19]
[20,"Résoudre des problèmes impliquant des longueurs, des masses, des contenances, des durées…",20]
[21,"(Se) repérer et (se) déplacer en utilisant des repères et des représentations.",21,null,"Espace et géométrie"]
[22,"Reconnaitre, nommer, décrire, reproduire quelques solides.",22]
[23,"Reconnaitre, nommer, décrire, reproduire, construire quelques figures géométriques.",23]
[24,"Reconnaitre et utiliser les notions d’alignement, d’angle droit, d’égalité de longueurs, de milieu…",24]

{"sheet":"Paramètres","index":16,"n_rows":51,"n_cols":3,"rows_kept":51,"cut":false,"hidden":true,"merged":[]}
[]
[null,"Code de correction","A"]
[null,"Code de correction",0]
[null,"Code de correction",1]
[null,"Code de correction",2]
[null,"Code de correction",3]
[null,"Code de correction",4]
[null,"Code de correction",5]
[null,"Code de correction",6]
[null,"Code de correction",7]
[null,"Code de correction",8]
[null,"Code de correction",9]
[null,"École","École élémentaire"]
[null,"École","École primaire"]
[null,"Année scolaire","2016-2017"]
[null,"Année scolaire","2017-2018"]
[null,"Année scolaire","2018-2019"]
[null,"Année scolaire","2019-2020"]
[null,"Année scolaire","2020-2021"]
[null,"Circonscription","1-2-4 Louvre"]
[null,"Circonscription","5-6 Luxembourg - Sorbonne"]
[null,"Circonscription","7-8 Invalides - Étoile"]
[null,"Circonscription","9-10A Rochechouart"]
[null,"Circonscription","10B Récollets"]
[null,"Circonscription","11A Voltaire"]
[null,"Circonscription","11B Bastille"]
[null,"Circonscription","12A-3 Daumesnil Marais"]
[null,"Circonscription","12B Nation"]
[null,"Circonscription","13A Olympiades"]
[null,"Circonscription","13B Butte aux Cailles"]
[null,"Circonscription","13C Austerlitz"]
[null,"Circonscription","14A Montparnasse"]
[null,"Circonscription","14B-15A Montsouris - Volontaires"]
[null,"Circonscription","15B Grenelle"]
[null,"Circonscription","15C Convention"]
[null,"Circonscription","16A Auteuil"]
[null,"Circonscription","16B Trocadéro"]
[null,"Circonscription","17A Wagram"]
[null,"Circonscription","17B Bessières"]
[null,"Circonscription","18A La Chapelle"]
[null,"Circonscription","18B La Goutte d'Or"]
[null,"Circonscription","18C Montmartre"]
[null,"Circonscription","18D Jules Joffrin"]
[null,"Circonscription","19A Buttes Chaumont"]
[null,"Circonscription","19B Stalingrad"]
[null,"Circonscription","19C Jaurès"]
[null,"Circonscription","19D Colonel Fabien"]
[null,"Circonscription","20A Télégraphe"]
[null,"Circonscription","20B Ménilmontant"]
[null,"Circonscription","20C Gambetta"]
[null,"Circonscription","20D Belleville"]